Visual Studio 2015 build failure

Previous Topic Next Topic
 
classic Classic list List threaded Threaded
1 message Options
Reply | Threaded
Open this post in threaded view
|

Visual Studio 2015 build failure

pepone.onrez
I trying to build openssl 1.0.2 from OpenSSL_1_0_2-stable branch and
keep getting this error


perl Configure VC-WIN32 no-asm enable-static-engine
ms\do_ms
nmake -f ms\ntdll.mak
....

        link /nologo /subsystem:console /opt:ref /debug /dll
/out:out32dll\libeay32.dll /def:ms/LIBEAY32.def
@C:\Users\ppgut\AppData\Local\Temp\nmE41E.tmp
     Creating library out32dll\libeay32.lib and object out32dll\libeay32.exp
bss_fd.obj : error LNK2001: unresolved external symbol
OPENSSL_UplinkTable [D:\3.7\openssl\msbuild\openssl.build.targets]
bss_file.obj : error LNK2001: unresolved external symbol
OPENSSL_UplinkTable [D:\3.7\openssl\msbuild\openssl.build.targets]
b_dump.obj : error LNK2001: unresolved external symbol
OPENSSL_UplinkTable [D:\3.7\openssl\msbuild\openssl.build.targets]
out32dll\libeay32.dll : fatal error LNK1120: 1 unresolved externals
[D:\3.7\openssl\msbuild\openssl.build.targets]
NMAKE : fatal error U1077: '"C:\Program Files (x86)\Microsoft Visual
Studio 14.0\VC\BIN\amd64\link.EXE"' : return code '0x460'
[D:\3.7\openssl\msbuild\openssl.build.targets]
  Stop.
D:\3.7\openssl\msbuild\openssl.build.targets(20,3): error MSB3073: The
command "nmake -f ms\ntdll.mak" exited with code 2.
--
openssl-users mailing list
To unsubscribe: https://mta.openssl.org/mailman/listinfo/openssl-users