Problem while compiling source code of OpenSSL 1.1.1

classic Classic list List threaded Threaded
1 message Options
Reply | Threaded
Open this post in threaded view

Problem while compiling source code of OpenSSL 1.1.1

ashish ajgaonkar

I am trying to compile source code of OpenSSL for androidplatform
While compilation Iam getting this error on my MSYS:

c:/android-ndk-r17c/toolchains/arm-linux-androideabi-4.9/prebuilt/windows-x86_64/bin/../lib/gcc/arm-linux-androideabi/4.9.x/../../../../arm-linux-androideabi/bin/ld.exe: error: c:/android-ndk-r17c/toolchains/arm-linux-androideabi-4.9/prebuilt/windows-x86_64/bin/../libexec/gcc/arm-linux-androideabi/4.9.x/liblto_plugin-0.dll: could not load plugin library: The parameter is incorrect.

collect2.exe: error: ld returned 1 exit status
make[1]: *** [Makefile:783:] Error 1
make[1]: Leaving directory '/e/SSLFEATURE/openssl-1.1.1'
make: *** [Makefile:171: all] Error 2

Please help me to solve this problem!

Thanks and regards

openssl-users mailing list
To unsubscribe: