Quantcast

Openssl-1.0.2h error while compilation

Previous Topic Next Topic
 
classic Classic list List threaded Threaded
1 message Options
Reply | Threaded
Open this post in threaded view
|  
Report Content as Inappropriate

Openssl-1.0.2h error while compilation

Openssl.User
This post was updated on .
Hello,

I am trying to compile openssl-1.0.2h.
When I do make I get the following issue:

/usr/bin/ld: libcrypto.a(mem_clr.o): Relocations in generic ELF (EM: 183)
libcrypto.a(mem_clr.o): error adding symbols: File in wrong format
collect2: error: ld returned 1 exit status
Makefile.shared:169: recipe for target 'link_a.gnu' failed
make[4]: *** [link_a.gnu] Error 1
make[4]: Leaving directory '/opt/poky/2.0.2_building/work/libssl1.0.2/openssl-1.0.2'
Makefile:354: recipe for target 'do_linux-shared' failed
make[3]: *** [do_linux-shared] Error 2
make[3]: Leaving directory '/opt/poky/2.0.2_building/work/libssl1.0.2/openssl-1.0.2'
Makefile:307: recipe for target 'libcrypto.so.1.0.0' failed
make[2]: *** [libcrypto.so.1.0.0] Error 2
make[2]: Leaving directory '/opt/poky/2.0.2_building/work/libssl1.0.2/openssl-1.0.2'
Makefile:109: recipe for target 'shared' failed
make[1]: *** [shared] Error 2
make[1]: Leaving directory '/opt/poky/2.0.2_building/work/libssl1.0.2/openssl-1.0.2/crypto'
Makefile:284: recipe for target 'build_crypto' failed
make: *** [build_crypto] Error 1

Any idea how can I fix it ?
Loading...