OPenSSL SNAP 20160312 issue

classic Classic list List threaded Threaded
16 messages Options
Reply | Threaded
Open this post in threaded view
|

OPenSSL SNAP 20160312 issue

The Doctor
make: don't know how to make crypto/aes/aes_cfb.o:crypto/aes/aes_cfb.o:. Stop

This was working yesterday.

--
Member - Liberal International This is doctor@@nl2k.ab.ca Ici doctor@@nl2k.ab.ca
God,Queen and country!Never Satan President Republic!Beware AntiChrist rising!
http://www.fullyfollow.me/rootnl2k  Look at Psalms 14 and 53 on Atheism
Manitoba and Saskatchewan! Save your provinces in April! Vote Liberal!!
--
openssl-dev mailing list
To unsubscribe: https://mta.openssl.org/mailman/listinfo/openssl-dev
Reply | Threaded
Open this post in threaded view
|

Re: OPenSSL SNAP 20160312 issue

Salz, Rich

> make: don't know how to make
> crypto/aes/aes_cfb.o:crypto/aes/aes_cfb.o:. Stop
>
> This was working yesterday.

And it will probably work again by tomorrow :)

Please include your config/setup command when you report things.

Please don't be surprised if a daily snapshot is broken for a day, consider waiting a day or two to see if the problem is fixed.

This is not the first time we've asked for this.
--
openssl-dev mailing list
To unsubscribe: https://mta.openssl.org/mailman/listinfo/openssl-dev
Reply | Threaded
Open this post in threaded view
|

Openssl SNAP 20160313 issue Re: OPenSSL SNAP 20160312 issue

The Doctor
On Sat, Mar 12, 2016 at 08:22:47PM +0000, Salz, Rich wrote:

>
> > make: don't know how to make
> > crypto/aes/aes_cfb.o:crypto/aes/aes_cfb.o:. Stop
> >
> > This was working yesterday.
>
> And it will probably work again by tomorrow :)
>
> Please include your config/setup command when you report things.
>
> Please don't be surprised if a daily snapshot is broken for a day, consider waiting a day or two to see if the problem is fixed.
>
> This is not the first time we've asked for this.

Now add Openssl-SNAP-20160313 issues

/bin/sh  ../configopenssl11
Configuring OpenSSL version 1.1.0-pre4-dev (0x0x10100004L)
    no-crypto-mdebug-backtrace [option]   OPENSSL_NO_CRYPTO_MDEBUG_BACKTRACE (skip dir)
    no-ec_nistp_64_gcc_128 [default]  OPENSSL_NO_EC_NISTP_64_GCC_128 (skip dir)
    no-heartbeats   [default]  OPENSSL_NO_HEARTBEATS (skip dir)
    no-md2          [default]  OPENSSL_NO_MD2 (skip dir)
    no-sctp         [option]   OPENSSL_NO_SCTP (skip dir)
    no-sse2         [option]
    no-ssl3         [default]  OPENSSL_NO_SSL3 (skip dir)
    no-ssl3-method  [default]  OPENSSL_NO_SSL3_METHOD (skip dir)
    no-static-engine [default]  OPENSSL_NO_STATIC_ENGINE (skip dir)
    no-weak-ssl-ciphers [default]  OPENSSL_NO_WEAK_SSL_CIPHERS (skip dir)
Configuring for debug-bsdi-x86-elf
IsMK1MF       =no
CC            =gcc
CFLAG         =-DPERL5 -DL_ENDIAN -DTERMIOS -fomit-frame-pointer -O2 -march=i486 -Wall -g
SHARED_CFLAG  =-fPIC
DEFINES       =DSO_DLFCN HAVE_DLFCN_H OPENSSL_THREADS OPENSSL_NO_STATIC_ENGINE OPENSSL_PIC OPENSSL_BN_ASM_PART_WORDS OPENSSL_BN_ASM_MONT OPENSSL_BN_ASM_GF2m SHA1_ASM SHA256_ASM SHA512_ASM MD5_ASM RMD160_ASM AES_ASM GHASH_ASM ECP_NISTZ256_ASM POLY1305_ASM
LFLAG         =-ldl -lgmp -lm -lc -lz
PLIB_LFLAG    =
EX_LIBS       =
APPS_OBJ      =
CPUID_OBJ     =mem_clr.o
UPLINK_OBJ    =
BN_ASM        =bn-586.o co-586.o x86-mont.o x86-gf2m.o
EC_ASM        =ecp_nistz256.o ecp_nistz256-x86.o
DES_ENC       =des-586.o crypt586.o
AES_ENC       =aes-586.o
BF_ENC        =bf-586.o
CAST_ENC      =c_enc.o
RC4_ENC       =rc4-586.o
RC5_ENC       =rc5-586.o
MD5_OBJ_ASM   =md5-586.o
SHA1_OBJ_ASM  =sha1-586.o sha256-586.o sha512-586.o
RMD160_OBJ_ASM=rmd-586.o
CMLL_ENC      =cmll-x86.o
MODES_OBJ     =ghash-x86.o
PADLOCK_OBJ   =e_padlock-x86.o
CHACHA_ENC    =chacha-x86.o
POLY1305_OBJ  =poly1305-x86.o
BLAKE2_OBJ    =
PROCESSOR     =386
RANLIB        =/usr/bin/ranlib
ARFLAGS       =
PERL          =/usr/bin/perl5

THIRTY_TWO_BIT mode
BN_LLONG mode

Configured for debug-bsdi-x86-elf.
( cd .; /usr/bin/perl5 util/ck_errf.pl -strict */*.c */*/*.c )
crypto/ex_data.c:254:crypto_get_ex_new_index:get_and_lock
FATAL: error discrepancy
*** Error code 1

Stop.
ns2.nl2k.ab.ca//usr/source/openssl-SNAP-20160313$ less ../configopenssl11
 ./Configure \
  386  \
  threads \
 shared \
 no-sse2 \
 enable-srtp \
 no-sctp \
 no-crypto-mdebug-backtrace \
 enable-capieng \
 enable-crypto-mdebug \
 enable-seed \
  enable-ssl-trace \
 enable-camellia \
 enable-rfc3779  enable-mdc2  enable-md5 \
 enable-rc5 \
 enable-unit-test \
 enable-dh \
 enable-bf \
 enable-cast \
 enable-chacha \
 enable-cmac \
 enable-cms \
 enable-ct \
 enable-des \
 enable-dsa \
 enable-dso \
 enable-ec \
 enable-engine \
 enable-err\
 enable-hmac \
 enable-poly1305 \
 enable-rsa \
 enable-sha  \
 enable-srp \
 enable-aes  \
 enable-egd \
 enable-zlib \
 zlib-dynamic \
 --prefix=/usr/contrib \
 --openssldir=/usr/contrib  debug-bsdi-x86-elf ; make update; make depend    

and what is debug-bsdi-x86-elf?

    "debug-bsdi-x86-elf" => {
        inherit_from     => [ asm("x86_elf_asm") ],
        cc               => "gcc",
        cflags           => "-DPERL5 -DL_ENDIAN -DTERMIOS -fomit-frame-pointer
-O2 -march=i486 -Wall -g",
        thread_cflag     => "-pthread -D_THREAD_SAFE -D_REENTRANT",
        lflags           => "-ldl -lgmp -lm -lc -lz",
        bn_ops           => "THIRTY_TWO_BIT_LONG RC4_CHUNK BN_LLONG ",
        dso_scheme       => "dlfcn",
        shared_target    => "bsd-gcc-shared",
        shared_cflag     => "-fPIC",
        shared_extension => ".so.\$(SHLIB_MAJOR).\$(SHLIB_MINOR)",
    },

       
I have to drop this each day in

Configurations/10-main.conf

> --
> openssl-dev mailing list
> To unsubscribe: https://mta.openssl.org/mailman/listinfo/openssl-dev

--
Member - Liberal International This is doctor@@nl2k.ab.ca Ici doctor@@nl2k.ab.ca
God,Queen and country!Never Satan President Republic!Beware AntiChrist rising!
http://www.fullyfollow.me/rootnl2k  Look at Psalms 14 and 53 on Atheism
Manitoba and Saskatchewan! Save your provinces in April! Vote Liberal!!
--
openssl-dev mailing list
To unsubscribe: https://mta.openssl.org/mailman/listinfo/openssl-dev
Reply | Threaded
Open this post in threaded view
|

Re: Openssl SNAP 20160313 issue Re: OPenSSL SNAP 20160312 issue

Richard Levitte - VMS Whacker-2
In message <[hidden email]> on Sun, 13 Mar 2016 06:32:11 -0600, The Doctor <[hidden email]> said:

doctor> On Sat, Mar 12, 2016 at 08:22:47PM +0000, Salz, Rich wrote:
doctor> >
doctor> > > make: don't know how to make
doctor> > > crypto/aes/aes_cfb.o:crypto/aes/aes_cfb.o:. Stop
doctor> > >
doctor> > > This was working yesterday.
doctor> >
doctor> > And it will probably work again by tomorrow :)
doctor> >
doctor> > Please include your config/setup command when you report things.
doctor> >
doctor> > Please don't be surprised if a daily snapshot is broken for a day, consider waiting a day or two to see if the problem is fixed.
doctor> >
doctor> > This is not the first time we've asked for this.
doctor>
doctor> Now add Openssl-SNAP-20160313 issues
doctor>
doctor> /bin/sh  ../configopenssl11
doctor> Configuring OpenSSL version 1.1.0-pre4-dev (0x0x10100004L)
doctor>     no-crypto-mdebug-backtrace [option]   OPENSSL_NO_CRYPTO_MDEBUG_BACKTRACE (skip dir)
doctor>     no-ec_nistp_64_gcc_128 [default]  OPENSSL_NO_EC_NISTP_64_GCC_128 (skip dir)
doctor>     no-heartbeats   [default]  OPENSSL_NO_HEARTBEATS (skip dir)
doctor>     no-md2          [default]  OPENSSL_NO_MD2 (skip dir)
doctor>     no-sctp         [option]   OPENSSL_NO_SCTP (skip dir)
doctor>     no-sse2         [option]
doctor>     no-ssl3         [default]  OPENSSL_NO_SSL3 (skip dir)
doctor>     no-ssl3-method  [default]  OPENSSL_NO_SSL3_METHOD (skip dir)
doctor>     no-static-engine [default]  OPENSSL_NO_STATIC_ENGINE (skip dir)
doctor>     no-weak-ssl-ciphers [default]  OPENSSL_NO_WEAK_SSL_CIPHERS (skip dir)
doctor> Configuring for debug-bsdi-x86-elf
doctor> IsMK1MF       =no
doctor> CC            =gcc
doctor> CFLAG         =-DPERL5 -DL_ENDIAN -DTERMIOS -fomit-frame-pointer -O2 -march=i486 -Wall -g
doctor> SHARED_CFLAG  =-fPIC
doctor> DEFINES       =DSO_DLFCN HAVE_DLFCN_H OPENSSL_THREADS OPENSSL_NO_STATIC_ENGINE OPENSSL_PIC OPENSSL_BN_ASM_PART_WORDS OPENSSL_BN_ASM_MONT OPENSSL_BN_ASM_GF2m SHA1_ASM SHA256_ASM SHA512_ASM MD5_ASM RMD160_ASM AES_ASM GHASH_ASM ECP_NISTZ256_ASM POLY1305_ASM
doctor> LFLAG         =-ldl -lgmp -lm -lc -lz
doctor> PLIB_LFLAG    =
doctor> EX_LIBS       =
doctor> APPS_OBJ      =
doctor> CPUID_OBJ     =mem_clr.o
doctor> UPLINK_OBJ    =
doctor> BN_ASM        =bn-586.o co-586.o x86-mont.o x86-gf2m.o
doctor> EC_ASM        =ecp_nistz256.o ecp_nistz256-x86.o
doctor> DES_ENC       =des-586.o crypt586.o
doctor> AES_ENC       =aes-586.o
doctor> BF_ENC        =bf-586.o
doctor> CAST_ENC      =c_enc.o
doctor> RC4_ENC       =rc4-586.o
doctor> RC5_ENC       =rc5-586.o
doctor> MD5_OBJ_ASM   =md5-586.o
doctor> SHA1_OBJ_ASM  =sha1-586.o sha256-586.o sha512-586.o
doctor> RMD160_OBJ_ASM=rmd-586.o
doctor> CMLL_ENC      =cmll-x86.o
doctor> MODES_OBJ     =ghash-x86.o
doctor> PADLOCK_OBJ   =e_padlock-x86.o
doctor> CHACHA_ENC    =chacha-x86.o
doctor> POLY1305_OBJ  =poly1305-x86.o
doctor> BLAKE2_OBJ    =
doctor> PROCESSOR     =386
doctor> RANLIB        =/usr/bin/ranlib
doctor> ARFLAGS       =
doctor> PERL          =/usr/bin/perl5
doctor>
doctor> THIRTY_TWO_BIT mode
doctor> BN_LLONG mode
doctor>
doctor> Configured for debug-bsdi-x86-elf.
doctor> ( cd .; /usr/bin/perl5 util/ck_errf.pl -strict */*.c */*/*.c )
doctor> crypto/ex_data.c:254:crypto_get_ex_new_index:get_and_lock
doctor> FATAL: error discrepancy
doctor> *** Error code 1

Thank you, that is indeed something still lingering.  Will be fixed.

doctor> Stop.
doctor> ns2.nl2k.ab.ca//usr/source/openssl-SNAP-20160313$ less ../configopenssl11
doctor>  ./Configure \
doctor>   386  \
doctor>   threads \
doctor>  shared \
doctor>  no-sse2 \
doctor>  enable-srtp \
doctor>  no-sctp \
doctor>  no-crypto-mdebug-backtrace \
doctor>  enable-capieng \
doctor>  enable-crypto-mdebug \
doctor>  enable-seed \
doctor>   enable-ssl-trace \
doctor>  enable-camellia \
doctor>  enable-rfc3779  enable-mdc2  enable-md5 \
doctor>  enable-rc5 \
doctor>  enable-unit-test \
doctor>  enable-dh \
doctor>  enable-bf \
doctor>  enable-cast \
doctor>  enable-chacha \
doctor>  enable-cmac \
doctor>  enable-cms \
doctor>  enable-ct \
doctor>  enable-des \
doctor>  enable-dsa \
doctor>  enable-dso \
doctor>  enable-ec \
doctor>  enable-engine \
doctor>  enable-err\
doctor>  enable-hmac \
doctor>  enable-poly1305 \
doctor>  enable-rsa \
doctor>  enable-sha  \
doctor>  enable-srp \
doctor>  enable-aes  \
doctor>  enable-egd \
doctor>  enable-zlib \
doctor>  zlib-dynamic \
doctor>  --prefix=/usr/contrib \
doctor>  --openssldir=/usr/contrib  debug-bsdi-x86-elf ; make update; make depend    
doctor>
doctor> and what is debug-bsdi-x86-elf?
doctor>
doctor>     "debug-bsdi-x86-elf" => {
doctor>         inherit_from     => [ asm("x86_elf_asm") ],
doctor>         cc               => "gcc",
doctor>         cflags           => "-DPERL5 -DL_ENDIAN -DTERMIOS -fomit-frame-pointer
doctor> -O2 -march=i486 -Wall -g",
doctor>         thread_cflag     => "-pthread -D_THREAD_SAFE -D_REENTRANT",
doctor>         lflags           => "-ldl -lgmp -lm -lc -lz",
doctor>         bn_ops           => "THIRTY_TWO_BIT_LONG RC4_CHUNK BN_LLONG ",
doctor>         dso_scheme       => "dlfcn",
doctor>         shared_target    => "bsd-gcc-shared",
doctor>         shared_cflag     => "-fPIC",
doctor>         shared_extension => ".so.\$(SHLIB_MAJOR).\$(SHLIB_MINOR)",
doctor>     },
doctor>
doctor>        
doctor> I have to drop this each day in
doctor>
doctor> Configurations/10-main.conf

Why do you have to drop in that file?  I suggest you make your own,
for example Configurations/20-doctor.conf.  That one will be picked up
along with the rest.

Also, if I may suggest, the "debug-" prefix is antiquated and has been
replaced with the '-d' option to 'config', which will use additional
debug flags where appropriate.  Unfortunately, the "bsdi-elf-gcc"
config has never had any debug variant to my knowledge, so I fully
understand your need there.

The config you have put together has a lot of similarities with the
"BSD-x86-elf" one, with just a few additions, so it could be made much
simpler like this:

    "bsdi-x86-elf" => {
        inherit_from  => [ "BSD-x86-elf" ],
        cflags        => add(picker(default => "-DPERL5 -DTERMIOS -march=i486",
                                    debug   => "-O2")),
        lflags        => add("-ldl -lgmp -lm -lc"),
    },

Note the 'debug => ...' line...  which flags will be added to the
cflags when you run './config' with the option '-d'.

All that I have removed is there in BSD-x86-elf, or default in the
case of the bn_ops (except for THIRTY_TWO_BIT_LONG that simply doesn't
exist and is silently ignored).  Note that '-lz' is added
automatically when you enable zlib, which your script does.

You may have copy copy the function 'picker' from that start of
10-main.conf.

--
Richard Levitte         [hidden email]
OpenSSL Project         http://www.openssl.org/~levitte/
--
openssl-dev mailing list
To unsubscribe: https://mta.openssl.org/mailman/listinfo/openssl-dev
Reply | Threaded
Open this post in threaded view
|

Openssl-SNAP-20160314 Re: Openssl SNAP 20160313 issue Re: OPenSSL SNAP 20160312 issue

The Doctor
On Sun, Mar 13, 2016 at 02:53:17PM +0100, Richard Levitte wrote:

> In message <[hidden email]> on Sun, 13 Mar 2016 06:32:11 -0600, The Doctor <[hidden email]> said:
>
> doctor> On Sat, Mar 12, 2016 at 08:22:47PM +0000, Salz, Rich wrote:
> doctor> >
> doctor> > > make: don't know how to make
> doctor> > > crypto/aes/aes_cfb.o:crypto/aes/aes_cfb.o:. Stop
> doctor> > >
> doctor> > > This was working yesterday.
> doctor> >
> doctor> > And it will probably work again by tomorrow :)
> doctor> >
> doctor> > Please include your config/setup command when you report things.
> doctor> >
> doctor> > Please don't be surprised if a daily snapshot is broken for a day, consider waiting a day or two to see if the problem is fixed.
> doctor> >
> doctor> > This is not the first time we've asked for this.
> doctor>
> doctor> Now add Openssl-SNAP-20160313 issues
> doctor>
> doctor> /bin/sh  ../configopenssl11
> doctor> Configuring OpenSSL version 1.1.0-pre4-dev (0x0x10100004L)
> doctor>     no-crypto-mdebug-backtrace [option]   OPENSSL_NO_CRYPTO_MDEBUG_BACKTRACE (skip dir)
> doctor>     no-ec_nistp_64_gcc_128 [default]  OPENSSL_NO_EC_NISTP_64_GCC_128 (skip dir)
> doctor>     no-heartbeats   [default]  OPENSSL_NO_HEARTBEATS (skip dir)
> doctor>     no-md2          [default]  OPENSSL_NO_MD2 (skip dir)
> doctor>     no-sctp         [option]   OPENSSL_NO_SCTP (skip dir)
> doctor>     no-sse2         [option]
> doctor>     no-ssl3         [default]  OPENSSL_NO_SSL3 (skip dir)
> doctor>     no-ssl3-method  [default]  OPENSSL_NO_SSL3_METHOD (skip dir)
> doctor>     no-static-engine [default]  OPENSSL_NO_STATIC_ENGINE (skip dir)
> doctor>     no-weak-ssl-ciphers [default]  OPENSSL_NO_WEAK_SSL_CIPHERS (skip dir)
> doctor> Configuring for debug-bsdi-x86-elf
> doctor> IsMK1MF       =no
> doctor> CC            =gcc
> doctor> CFLAG         =-DPERL5 -DL_ENDIAN -DTERMIOS -fomit-frame-pointer -O2 -march=i486 -Wall -g
> doctor> SHARED_CFLAG  =-fPIC
> doctor> DEFINES       =DSO_DLFCN HAVE_DLFCN_H OPENSSL_THREADS OPENSSL_NO_STATIC_ENGINE OPENSSL_PIC OPENSSL_BN_ASM_PART_WORDS OPENSSL_BN_ASM_MONT OPENSSL_BN_ASM_GF2m SHA1_ASM SHA256_ASM SHA512_ASM MD5_ASM RMD160_ASM AES_ASM GHASH_ASM ECP_NISTZ256_ASM POLY1305_ASM
> doctor> LFLAG         =-ldl -lgmp -lm -lc -lz
> doctor> PLIB_LFLAG    =
> doctor> EX_LIBS       =
> doctor> APPS_OBJ      =
> doctor> CPUID_OBJ     =mem_clr.o
> doctor> UPLINK_OBJ    =
> doctor> BN_ASM        =bn-586.o co-586.o x86-mont.o x86-gf2m.o
> doctor> EC_ASM        =ecp_nistz256.o ecp_nistz256-x86.o
> doctor> DES_ENC       =des-586.o crypt586.o
> doctor> AES_ENC       =aes-586.o
> doctor> BF_ENC        =bf-586.o
> doctor> CAST_ENC      =c_enc.o
> doctor> RC4_ENC       =rc4-586.o
> doctor> RC5_ENC       =rc5-586.o
> doctor> MD5_OBJ_ASM   =md5-586.o
> doctor> SHA1_OBJ_ASM  =sha1-586.o sha256-586.o sha512-586.o
> doctor> RMD160_OBJ_ASM=rmd-586.o
> doctor> CMLL_ENC      =cmll-x86.o
> doctor> MODES_OBJ     =ghash-x86.o
> doctor> PADLOCK_OBJ   =e_padlock-x86.o
> doctor> CHACHA_ENC    =chacha-x86.o
> doctor> POLY1305_OBJ  =poly1305-x86.o
> doctor> BLAKE2_OBJ    =
> doctor> PROCESSOR     =386
> doctor> RANLIB        =/usr/bin/ranlib
> doctor> ARFLAGS       =
> doctor> PERL          =/usr/bin/perl5
> doctor>
> doctor> THIRTY_TWO_BIT mode
> doctor> BN_LLONG mode
> doctor>
> doctor> Configured for debug-bsdi-x86-elf.
> doctor> ( cd .; /usr/bin/perl5 util/ck_errf.pl -strict */*.c */*/*.c )
> doctor> crypto/ex_data.c:254:crypto_get_ex_new_index:get_and_lock
> doctor> FATAL: error discrepancy
> doctor> *** Error code 1
>
> Thank you, that is indeed something still lingering.  Will be fixed.
>
> doctor> Stop.
> doctor> ns2.nl2k.ab.ca//usr/source/openssl-SNAP-20160313$ less ../configopenssl11
> doctor>  ./Configure \
> doctor>   386  \
> doctor>   threads \
> doctor>  shared \
> doctor>  no-sse2 \
> doctor>  enable-srtp \
> doctor>  no-sctp \
> doctor>  no-crypto-mdebug-backtrace \
> doctor>  enable-capieng \
> doctor>  enable-crypto-mdebug \
> doctor>  enable-seed \
> doctor>   enable-ssl-trace \
> doctor>  enable-camellia \
> doctor>  enable-rfc3779  enable-mdc2  enable-md5 \
> doctor>  enable-rc5 \
> doctor>  enable-unit-test \
> doctor>  enable-dh \
> doctor>  enable-bf \
> doctor>  enable-cast \
> doctor>  enable-chacha \
> doctor>  enable-cmac \
> doctor>  enable-cms \
> doctor>  enable-ct \
> doctor>  enable-des \
> doctor>  enable-dsa \
> doctor>  enable-dso \
> doctor>  enable-ec \
> doctor>  enable-engine \
> doctor>  enable-err\
> doctor>  enable-hmac \
> doctor>  enable-poly1305 \
> doctor>  enable-rsa \
> doctor>  enable-sha  \
> doctor>  enable-srp \
> doctor>  enable-aes  \
> doctor>  enable-egd \
> doctor>  enable-zlib \
> doctor>  zlib-dynamic \
> doctor>  --prefix=/usr/contrib \
> doctor>  --openssldir=/usr/contrib  debug-bsdi-x86-elf ; make update; make depend    
> doctor>
> doctor> and what is debug-bsdi-x86-elf?
> doctor>
> doctor>     "debug-bsdi-x86-elf" => {
> doctor>         inherit_from     => [ asm("x86_elf_asm") ],
> doctor>         cc               => "gcc",
> doctor>         cflags           => "-DPERL5 -DL_ENDIAN -DTERMIOS -fomit-frame-pointer
> doctor> -O2 -march=i486 -Wall -g",
> doctor>         thread_cflag     => "-pthread -D_THREAD_SAFE -D_REENTRANT",
> doctor>         lflags           => "-ldl -lgmp -lm -lc -lz",
> doctor>         bn_ops           => "THIRTY_TWO_BIT_LONG RC4_CHUNK BN_LLONG ",
> doctor>         dso_scheme       => "dlfcn",
> doctor>         shared_target    => "bsd-gcc-shared",
> doctor>         shared_cflag     => "-fPIC",
> doctor>         shared_extension => ".so.\$(SHLIB_MAJOR).\$(SHLIB_MINOR)",
> doctor>     },
> doctor>
> doctor>        
> doctor> I have to drop this each day in
> doctor>
> doctor> Configurations/10-main.conf
>
> Why do you have to drop in that file?  I suggest you make your own,
> for example Configurations/20-doctor.conf.  That one will be picked up
> along with the rest.
>
> Also, if I may suggest, the "debug-" prefix is antiquated and has been
> replaced with the '-d' option to 'config', which will use additional
> debug flags where appropriate.  Unfortunately, the "bsdi-elf-gcc"
> config has never had any debug variant to my knowledge, so I fully
> understand your need there.
>
> The config you have put together has a lot of similarities with the
> "BSD-x86-elf" one, with just a few additions, so it could be made much
> simpler like this:
>
>     "bsdi-x86-elf" => {
>         inherit_from  => [ "BSD-x86-elf" ],
> cflags        => add(picker(default => "-DPERL5 -DTERMIOS -march=i486",
>                                     debug   => "-O2")),
>         lflags        => add("-ldl -lgmp -lm -lc"),
>     },
>
> Note the 'debug => ...' line...  which flags will be added to the
> cflags when you run './config' with the option '-d'.
>
> All that I have removed is there in BSD-x86-elf, or default in the
> case of the bn_ops (except for THIRTY_TWO_BIT_LONG that simply doesn't
> exist and is silently ignored).  Note that '-lz' is added
> automatically when you enable zlib, which your script does.
>
> You may have copy copy the function 'picker' from that start of
> 10-main.conf.
>

I will stick with what works.

Also this showed up on

openssl-SNAP-20160314

//usr/source/openssl-SNAP-20160314$ make
make: don't know how to make crypto/aes/aes_cfb.o:crypto/aes/aes_cfb.o:. Stop

I got a bit compiled until this happened.

Last working package was

openssl-SNAP-20160311 .
 
> --
> Richard Levitte         [hidden email]
> OpenSSL Project         http://www.openssl.org/~levitte/
> --
> openssl-dev mailing list
> To unsubscribe: https://mta.openssl.org/mailman/listinfo/openssl-dev

--
Member - Liberal International This is doctor@@nl2k.ab.ca Ici doctor@@nl2k.ab.ca
God,Queen and country!Never Satan President Republic!Beware AntiChrist rising!
http://www.fullyfollow.me/rootnl2k  Look at Psalms 14 and 53 on Atheism
Manitoba and Saskatchewan! Save your provinces in April! Vote Liberal!!
--
openssl-dev mailing list
To unsubscribe: https://mta.openssl.org/mailman/listinfo/openssl-dev
Reply | Threaded
Open this post in threaded view
|

Openssl-SNAP-20160315 issue Re: Openssl-SNAP-20160314 Re: Openssl SNAP 20160313 issue Re: OPenSSL SNAP 20160312 issue

The Doctor
On Mon, Mar 14, 2016 at 09:02:56AM -0600, The Doctor wrote:

> On Sun, Mar 13, 2016 at 02:53:17PM +0100, Richard Levitte wrote:
> > In message <[hidden email]> on Sun, 13 Mar 2016 06:32:11 -0600, The Doctor <[hidden email]> said:
> >
> > doctor> On Sat, Mar 12, 2016 at 08:22:47PM +0000, Salz, Rich wrote:
> > doctor> >
> > doctor> > > make: don't know how to make
> > doctor> > > crypto/aes/aes_cfb.o:crypto/aes/aes_cfb.o:. Stop
> > doctor> > >
> > doctor> > > This was working yesterday.
> > doctor> >
> > doctor> > And it will probably work again by tomorrow :)
> > doctor> >
> > doctor> > Please include your config/setup command when you report things.
> > doctor> >
> > doctor> > Please don't be surprised if a daily snapshot is broken for a day, consider waiting a day or two to see if the problem is fixed.
> > doctor> >
> > doctor> > This is not the first time we've asked for this.
> > doctor>
> > doctor> Now add Openssl-SNAP-20160313 issues
> > doctor>
> > doctor> /bin/sh  ../configopenssl11
> > doctor> Configuring OpenSSL version 1.1.0-pre4-dev (0x0x10100004L)
> > doctor>     no-crypto-mdebug-backtrace [option]   OPENSSL_NO_CRYPTO_MDEBUG_BACKTRACE (skip dir)
> > doctor>     no-ec_nistp_64_gcc_128 [default]  OPENSSL_NO_EC_NISTP_64_GCC_128 (skip dir)
> > doctor>     no-heartbeats   [default]  OPENSSL_NO_HEARTBEATS (skip dir)
> > doctor>     no-md2          [default]  OPENSSL_NO_MD2 (skip dir)
> > doctor>     no-sctp         [option]   OPENSSL_NO_SCTP (skip dir)
> > doctor>     no-sse2         [option]
> > doctor>     no-ssl3         [default]  OPENSSL_NO_SSL3 (skip dir)
> > doctor>     no-ssl3-method  [default]  OPENSSL_NO_SSL3_METHOD (skip dir)
> > doctor>     no-static-engine [default]  OPENSSL_NO_STATIC_ENGINE (skip dir)
> > doctor>     no-weak-ssl-ciphers [default]  OPENSSL_NO_WEAK_SSL_CIPHERS (skip dir)
> > doctor> Configuring for debug-bsdi-x86-elf
> > doctor> IsMK1MF       =no
> > doctor> CC            =gcc
> > doctor> CFLAG         =-DPERL5 -DL_ENDIAN -DTERMIOS -fomit-frame-pointer -O2 -march=i486 -Wall -g
> > doctor> SHARED_CFLAG  =-fPIC
> > doctor> DEFINES       =DSO_DLFCN HAVE_DLFCN_H OPENSSL_THREADS OPENSSL_NO_STATIC_ENGINE OPENSSL_PIC OPENSSL_BN_ASM_PART_WORDS OPENSSL_BN_ASM_MONT OPENSSL_BN_ASM_GF2m SHA1_ASM SHA256_ASM SHA512_ASM MD5_ASM RMD160_ASM AES_ASM GHASH_ASM ECP_NISTZ256_ASM POLY1305_ASM
> > doctor> LFLAG         =-ldl -lgmp -lm -lc -lz
> > doctor> PLIB_LFLAG    =
> > doctor> EX_LIBS       =
> > doctor> APPS_OBJ      =
> > doctor> CPUID_OBJ     =mem_clr.o
> > doctor> UPLINK_OBJ    =
> > doctor> BN_ASM        =bn-586.o co-586.o x86-mont.o x86-gf2m.o
> > doctor> EC_ASM        =ecp_nistz256.o ecp_nistz256-x86.o
> > doctor> DES_ENC       =des-586.o crypt586.o
> > doctor> AES_ENC       =aes-586.o
> > doctor> BF_ENC        =bf-586.o
> > doctor> CAST_ENC      =c_enc.o
> > doctor> RC4_ENC       =rc4-586.o
> > doctor> RC5_ENC       =rc5-586.o
> > doctor> MD5_OBJ_ASM   =md5-586.o
> > doctor> SHA1_OBJ_ASM  =sha1-586.o sha256-586.o sha512-586.o
> > doctor> RMD160_OBJ_ASM=rmd-586.o
> > doctor> CMLL_ENC      =cmll-x86.o
> > doctor> MODES_OBJ     =ghash-x86.o
> > doctor> PADLOCK_OBJ   =e_padlock-x86.o
> > doctor> CHACHA_ENC    =chacha-x86.o
> > doctor> POLY1305_OBJ  =poly1305-x86.o
> > doctor> BLAKE2_OBJ    =
> > doctor> PROCESSOR     =386
> > doctor> RANLIB        =/usr/bin/ranlib
> > doctor> ARFLAGS       =
> > doctor> PERL          =/usr/bin/perl5
> > doctor>
> > doctor> THIRTY_TWO_BIT mode
> > doctor> BN_LLONG mode
> > doctor>
> > doctor> Configured for debug-bsdi-x86-elf.
> > doctor> ( cd .; /usr/bin/perl5 util/ck_errf.pl -strict */*.c */*/*.c )
> > doctor> crypto/ex_data.c:254:crypto_get_ex_new_index:get_and_lock
> > doctor> FATAL: error discrepancy
> > doctor> *** Error code 1
> >
> > Thank you, that is indeed something still lingering.  Will be fixed.
> >
> > doctor> Stop.
> > doctor> ns2.nl2k.ab.ca//usr/source/openssl-SNAP-20160313$ less ../configopenssl11
> > doctor>  ./Configure \
> > doctor>   386  \
> > doctor>   threads \
> > doctor>  shared \
> > doctor>  no-sse2 \
> > doctor>  enable-srtp \
> > doctor>  no-sctp \
> > doctor>  no-crypto-mdebug-backtrace \
> > doctor>  enable-capieng \
> > doctor>  enable-crypto-mdebug \
> > doctor>  enable-seed \
> > doctor>   enable-ssl-trace \
> > doctor>  enable-camellia \
> > doctor>  enable-rfc3779  enable-mdc2  enable-md5 \
> > doctor>  enable-rc5 \
> > doctor>  enable-unit-test \
> > doctor>  enable-dh \
> > doctor>  enable-bf \
> > doctor>  enable-cast \
> > doctor>  enable-chacha \
> > doctor>  enable-cmac \
> > doctor>  enable-cms \
> > doctor>  enable-ct \
> > doctor>  enable-des \
> > doctor>  enable-dsa \
> > doctor>  enable-dso \
> > doctor>  enable-ec \
> > doctor>  enable-engine \
> > doctor>  enable-err\
> > doctor>  enable-hmac \
> > doctor>  enable-poly1305 \
> > doctor>  enable-rsa \
> > doctor>  enable-sha  \
> > doctor>  enable-srp \
> > doctor>  enable-aes  \
> > doctor>  enable-egd \
> > doctor>  enable-zlib \
> > doctor>  zlib-dynamic \
> > doctor>  --prefix=/usr/contrib \
> > doctor>  --openssldir=/usr/contrib  debug-bsdi-x86-elf ; make update; make depend    
> > doctor>
> > doctor> and what is debug-bsdi-x86-elf?
> > doctor>
> > doctor>     "debug-bsdi-x86-elf" => {
> > doctor>         inherit_from     => [ asm("x86_elf_asm") ],
> > doctor>         cc               => "gcc",
> > doctor>         cflags           => "-DPERL5 -DL_ENDIAN -DTERMIOS -fomit-frame-pointer
> > doctor> -O2 -march=i486 -Wall -g",
> > doctor>         thread_cflag     => "-pthread -D_THREAD_SAFE -D_REENTRANT",
> > doctor>         lflags           => "-ldl -lgmp -lm -lc -lz",
> > doctor>         bn_ops           => "THIRTY_TWO_BIT_LONG RC4_CHUNK BN_LLONG ",
> > doctor>         dso_scheme       => "dlfcn",
> > doctor>         shared_target    => "bsd-gcc-shared",
> > doctor>         shared_cflag     => "-fPIC",
> > doctor>         shared_extension => ".so.\$(SHLIB_MAJOR).\$(SHLIB_MINOR)",
> > doctor>     },
> > doctor>
> > doctor>        
> > doctor> I have to drop this each day in
> > doctor>
> > doctor> Configurations/10-main.conf
> >
> > Why do you have to drop in that file?  I suggest you make your own,
> > for example Configurations/20-doctor.conf.  That one will be picked up
> > along with the rest.
> >
> > Also, if I may suggest, the "debug-" prefix is antiquated and has been
> > replaced with the '-d' option to 'config', which will use additional
> > debug flags where appropriate.  Unfortunately, the "bsdi-elf-gcc"
> > config has never had any debug variant to my knowledge, so I fully
> > understand your need there.
> >
> > The config you have put together has a lot of similarities with the
> > "BSD-x86-elf" one, with just a few additions, so it could be made much
> > simpler like this:
> >
> >     "bsdi-x86-elf" => {
> >         inherit_from  => [ "BSD-x86-elf" ],
> > cflags        => add(picker(default => "-DPERL5 -DTERMIOS -march=i486",
> >                                     debug   => "-O2")),
> >         lflags        => add("-ldl -lgmp -lm -lc"),
> >     },
> >
> > Note the 'debug => ...' line...  which flags will be added to the
> > cflags when you run './config' with the option '-d'.
> >
> > All that I have removed is there in BSD-x86-elf, or default in the
> > case of the bn_ops (except for THIRTY_TWO_BIT_LONG that simply doesn't
> > exist and is silently ignored).  Note that '-lz' is added
> > automatically when you enable zlib, which your script does.
> >
> > You may have copy copy the function 'picker' from that start of
> > 10-main.conf.
> >
>
> I will stick with what works.
>
> Also this showed up on
>
> openssl-SNAP-20160314
>
> //usr/source/openssl-SNAP-20160314$ make
> make: don't know how to make crypto/aes/aes_cfb.o:crypto/aes/aes_cfb.o:. Stop
>
> I got a bit compiled until this happened.
>
> Last working package was
>
> openssl-SNAP-20160311 .
>

Still the same issue with openssl-SNAP-20160315 .

What is the problem with  crypto/aes/aes_cfb.o
??
 

> > --
> > Richard Levitte         [hidden email]
> > OpenSSL Project         http://www.openssl.org/~levitte/
> > --
> > openssl-dev mailing list
> > To unsubscribe: https://mta.openssl.org/mailman/listinfo/openssl-dev
>
> --
> Member - Liberal International This is doctor@@nl2k.ab.ca Ici doctor@@nl2k.ab.ca
> God,Queen and country!Never Satan President Republic!Beware AntiChrist rising!
> http://www.fullyfollow.me/rootnl2k  Look at Psalms 14 and 53 on Atheism
> Manitoba and Saskatchewan! Save your provinces in April! Vote Liberal!!
> --
> openssl-dev mailing list
> To unsubscribe: https://mta.openssl.org/mailman/listinfo/openssl-dev

--
Member - Liberal International This is doctor@@nl2k.ab.ca Ici doctor@@nl2k.ab.ca
God,Queen and country!Never Satan President Republic!Beware AntiChrist rising!
http://www.fullyfollow.me/rootnl2k  Look at Psalms 14 and 53 on Atheism
Manitoba and Saskatchewan! Save your provinces in April! Vote Liberal!!
--
openssl-dev mailing list
To unsubscribe: https://mta.openssl.org/mailman/listinfo/openssl-dev
Reply | Threaded
Open this post in threaded view
|

Re: Openssl-SNAP-20160315 issue Re: Openssl-SNAP-20160314 Re: Openssl SNAP 20160313 issue Re: OPenSSL SNAP 20160312 issue

Richard Levitte - VMS Whacker-2
In message <[hidden email]> on Tue, 15 Mar 2016 09:32:42 -0600, The Doctor <[hidden email]> said:

doctor> On Mon, Mar 14, 2016 at 09:02:56AM -0600, The Doctor wrote:
doctor> > //usr/source/openssl-SNAP-20160314$ make
doctor> > make: don't know how to make crypto/aes/aes_cfb.o:crypto/aes/aes_cfb.o:. Stop
doctor> >
doctor> > I got a bit compiled until this happened.
doctor> >
doctor> > Last working package was
doctor> >
doctor> > openssl-SNAP-20160311 .
doctor> >
doctor>
doctor> Still the same issue with openssl-SNAP-20160315 .
doctor>
doctor> What is the problem with  crypto/aes/aes_cfb.o
doctor> ??

Hmmm, the seems like an issue with dependency making, somehow.

could you run this command and send me the result (I hope your grep
understands -A and -B, which is used to display a number of lines
After and Before a match)?

$ grep -A5 -B5 aes_cfb.o:crypto Makefile

--
Richard Levitte         [hidden email]
OpenSSL Project         http://www.openssl.org/~levitte/
--
openssl-dev mailing list
To unsubscribe: https://mta.openssl.org/mailman/listinfo/openssl-dev
Reply | Threaded
Open this post in threaded view
|

Re: Openssl-SNAP-20160315 issue Re: Openssl-SNAP-20160314 Re: Openssl SNAP 20160313 issue Re: OPenSSL SNAP 20160312 issue

The Doctor
On Tue, Mar 15, 2016 at 06:09:08PM +0100, Richard Levitte wrote:

> In message <[hidden email]> on Tue, 15 Mar 2016 09:32:42 -0600, The Doctor <[hidden email]> said:
>
> doctor> On Mon, Mar 14, 2016 at 09:02:56AM -0600, The Doctor wrote:
> doctor> > //usr/source/openssl-SNAP-20160314$ make
> doctor> > make: don't know how to make crypto/aes/aes_cfb.o:crypto/aes/aes_cfb.o:. Stop
> doctor> >
> doctor> > I got a bit compiled until this happened.
> doctor> >
> doctor> > Last working package was
> doctor> >
> doctor> > openssl-SNAP-20160311 .
> doctor> >
> doctor>
> doctor> Still the same issue with openssl-SNAP-20160315 .
> doctor>
> doctor> What is the problem with  crypto/aes/aes_cfb.o
> doctor> ??
>
> Hmmm, the seems like an issue with dependency making, somehow.
>
> could you run this command and send me the result (I hope your grep
> understands -A and -B, which is used to display a number of lines
> After and Before a match)?
>
> $ grep -A5 -B5 aes_cfb.o:crypto Makefile
>

The result is

crypto/comp/c_zlib.o:crypto/comp/c_zlib.o: crypto/comp/comp_lcl.h
# DO NOT DELETE

crypto/aes/aes_cfb.o: include/openssl/aes.h
crypto/aes/aes_cfb.o: include/openssl/opensslconf.h
crypto/aes/aes_cfb.o:crypto/aes/aes_cfb.o:crypto/aes/aes_cfb.o: include/openssl/modes.h
# DO NOT DELETE

crypto/asn1/asn_mstbl.o:crypto/asn1/asn_mstbl.o:crypto/asn1/asn_mstbl.o:crypto/asn1/asn_mstbl.o:crypto/asn1/asn_mstbl.o:crypto/asn1/asn_mstbl.o:crypto/asn1/asn_mstbl.o:crypto/asn1/asn_mstbl.o:crypto/asn1/asn_mstbl.o:crypto/asn1/asn_mstbl.o:crypto/asn1/asn_mstbl.o: include/openssl/crypto.h
crypto/asn1/asn_mstbl.o:crypto/asn1/asn_mstbl.o:crypto/asn1/asn_mstbl.o:crypto/asn1/asn_mstbl.o: include/openssl/e_os2.h
crypto/asn1/asn_mstbl.o: include/openssl/opensslconf.h

 
> --
> Richard Levitte         [hidden email]
> OpenSSL Project         http://www.openssl.org/~levitte/
> --
> openssl-dev mailing list
> To unsubscribe: https://mta.openssl.org/mailman/listinfo/openssl-dev

--
Member - Liberal International This is doctor@@nl2k.ab.ca Ici doctor@@nl2k.ab.ca
God,Queen and country!Never Satan President Republic!Beware AntiChrist rising!
http://www.fullyfollow.me/rootnl2k  Look at Psalms 14 and 53 on Atheism
Manitoba and Saskatchewan! Save your provinces in April! Vote Liberal!!
--
openssl-dev mailing list
To unsubscribe: https://mta.openssl.org/mailman/listinfo/openssl-dev
Reply | Threaded
Open this post in threaded view
|

Re: Openssl-SNAP-20160315 issue Re: Openssl-SNAP-20160314 Re: Openssl SNAP 20160313 issue Re: OPenSSL SNAP 20160312 issue

Richard Levitte - VMS Whacker-2
In message <[hidden email]> on Tue, 15 Mar 2016 14:01:07 -0600, The Doctor <[hidden email]> said:

doctor> On Tue, Mar 15, 2016 at 06:09:08PM +0100, Richard Levitte wrote:
doctor> > In message <[hidden email]> on Tue, 15 Mar 2016 09:32:42 -0600, The Doctor <[hidden email]> said:
doctor> >
doctor> > doctor> On Mon, Mar 14, 2016 at 09:02:56AM -0600, The Doctor wrote:
doctor> > doctor> > //usr/source/openssl-SNAP-20160314$ make
doctor> > doctor> > make: don't know how to make crypto/aes/aes_cfb.o:crypto/aes/aes_cfb.o:. Stop
doctor> > doctor> >
doctor> > doctor> > I got a bit compiled until this happened.
doctor> > doctor> >
doctor> > doctor> > Last working package was
doctor> > doctor> >
doctor> > doctor> > openssl-SNAP-20160311 .
doctor> > doctor> >
doctor> > doctor>
doctor> > doctor> Still the same issue with openssl-SNAP-20160315 .
doctor> > doctor>
doctor> > doctor> What is the problem with  crypto/aes/aes_cfb.o
doctor> > doctor> ??
doctor> >
doctor> > Hmmm, the seems like an issue with dependency making, somehow.
doctor> >
doctor> > could you run this command and send me the result (I hope your grep
doctor> > understands -A and -B, which is used to display a number of lines
doctor> > After and Before a match)?
doctor> >
doctor> > $ grep -A5 -B5 aes_cfb.o:crypto Makefile
doctor> >
doctor>
doctor> The result is
doctor>
doctor> crypto/comp/c_zlib.o:crypto/comp/c_zlib.o: crypto/comp/comp_lcl.h
doctor> # DO NOT DELETE
doctor>
doctor> crypto/aes/aes_cfb.o: include/openssl/aes.h
doctor> crypto/aes/aes_cfb.o: include/openssl/opensslconf.h
doctor> crypto/aes/aes_cfb.o:crypto/aes/aes_cfb.o:crypto/aes/aes_cfb.o: include/openssl/modes.h
doctor> # DO NOT DELETE
doctor>
doctor> crypto/asn1/asn_mstbl.o:crypto/asn1/asn_mstbl.o:crypto/asn1/asn_mstbl.o:crypto/asn1/asn_mstbl.o:crypto/asn1/asn_mstbl.o:crypto/asn1/asn_mstbl.o:crypto/asn1/asn_mstbl.o:crypto/asn1/asn_mstbl.o:crypto/asn1/asn_mstbl.o:crypto/asn1/asn_mstbl.o:crypto/asn1/asn_mstbl.o: include/openssl/crypto.h
doctor> crypto/asn1/asn_mstbl.o:crypto/asn1/asn_mstbl.o:crypto/asn1/asn_mstbl.o:crypto/asn1/asn_mstbl.o: include/openssl/e_os2.h
doctor> crypto/asn1/asn_mstbl.o: include/openssl/opensslconf.h

Ok, that's what I expected.  So there seems to be some odd interaction
between the makedepend and the post-processing perl snippet.

Could you do the following for me?

$ rm crypto/aes/aes_cfb.d
$ make crypto/aes/aes_cfb.d

And then, copy-n-paste only the makedepend command and execute it, and
send me the resulting crypto/aes/aes_cfb.d.tmp as an attachment.  I
want to see its exact content to see what perl does wrong.

Cheers,
Richard

--
Richard Levitte         [hidden email]
OpenSSL Project         http://www.openssl.org/~levitte/
--
openssl-dev mailing list
To unsubscribe: https://mta.openssl.org/mailman/listinfo/openssl-dev
Reply | Threaded
Open this post in threaded view
|

Re: Openssl-SNAP-20160315 issue Re: Openssl-SNAP-20160314 Re: Openssl SNAP 20160313 issue Re: OPenSSL SNAP 20160312 issue

The Doctor
On Tue, Mar 15, 2016 at 09:22:49PM +0100, Richard Levitte wrote:

> In message <[hidden email]> on Tue, 15 Mar 2016 14:01:07 -0600, The Doctor <[hidden email]> said:
>
> doctor> On Tue, Mar 15, 2016 at 06:09:08PM +0100, Richard Levitte wrote:
> doctor> > In message <[hidden email]> on Tue, 15 Mar 2016 09:32:42 -0600, The Doctor <[hidden email]> said:
> doctor> >
> doctor> > doctor> On Mon, Mar 14, 2016 at 09:02:56AM -0600, The Doctor wrote:
> doctor> > doctor> > //usr/source/openssl-SNAP-20160314$ make
> doctor> > doctor> > make: don't know how to make crypto/aes/aes_cfb.o:crypto/aes/aes_cfb.o:. Stop
> doctor> > doctor> >
> doctor> > doctor> > I got a bit compiled until this happened.
> doctor> > doctor> >
> doctor> > doctor> > Last working package was
> doctor> > doctor> >
> doctor> > doctor> > openssl-SNAP-20160311 .
> doctor> > doctor> >
> doctor> > doctor>
> doctor> > doctor> Still the same issue with openssl-SNAP-20160315 .
> doctor> > doctor>
> doctor> > doctor> What is the problem with  crypto/aes/aes_cfb.o
> doctor> > doctor> ??
> doctor> >
> doctor> > Hmmm, the seems like an issue with dependency making, somehow.
> doctor> >
> doctor> > could you run this command and send me the result (I hope your grep
> doctor> > understands -A and -B, which is used to display a number of lines
> doctor> > After and Before a match)?
> doctor> >
> doctor> > $ grep -A5 -B5 aes_cfb.o:crypto Makefile
> doctor> >
> doctor>
> doctor> The result is
> doctor>
> doctor> crypto/comp/c_zlib.o:crypto/comp/c_zlib.o: crypto/comp/comp_lcl.h
> doctor> # DO NOT DELETE
> doctor>
> doctor> crypto/aes/aes_cfb.o: include/openssl/aes.h
> doctor> crypto/aes/aes_cfb.o: include/openssl/opensslconf.h
> doctor> crypto/aes/aes_cfb.o:crypto/aes/aes_cfb.o:crypto/aes/aes_cfb.o: include/openssl/modes.h
> doctor> # DO NOT DELETE
> doctor>
> doctor> crypto/asn1/asn_mstbl.o:crypto/asn1/asn_mstbl.o:crypto/asn1/asn_mstbl.o:crypto/asn1/asn_mstbl.o:crypto/asn1/asn_mstbl.o:crypto/asn1/asn_mstbl.o:crypto/asn1/asn_mstbl.o:crypto/asn1/asn_mstbl.o:crypto/asn1/asn_mstbl.o:crypto/asn1/asn_mstbl.o:crypto/asn1/asn_mstbl.o: include/openssl/crypto.h
> doctor> crypto/asn1/asn_mstbl.o:crypto/asn1/asn_mstbl.o:crypto/asn1/asn_mstbl.o:crypto/asn1/asn_mstbl.o: include/openssl/e_os2.h
> doctor> crypto/asn1/asn_mstbl.o: include/openssl/opensslconf.h
>
> Ok, that's what I expected.  So there seems to be some odd interaction
> between the makedepend and the post-processing perl snippet.
>
> Could you do the following for me?
>
> $ rm crypto/aes/aes_cfb.d
> $ make crypto/aes/aes_cfb.d

We get

/usr/X11/bin/makedepend -fcrypto/aes/aes_cfb.d.tmp -o"|crypto/aes/aes_cfb.o" -- -DZLIB_SHARED -DDSO_DLFCN -DHAVE_DLFCN_H -DOPENSSL_THREADS -DOPENSSL_NO_STATIC_ENGINE -DOPENSSL_PIC -DOPENSSL_BN_ASM_PART_WORDS -DOPENSSL_BN_ASM_MONT -DOPENSSL_BN_ASM_GF2m -DSHA1_ASM -DSHA256_ASM -DSHA512_ASM -DMD5_ASM -DRMD160_ASM -DAES_ASM -DGHASH_ASM -DECP_NISTZ256_ASM -DPOLY1305_ASM -DOPENSSLDIR="\"/usr/contrib\"" -DENGINESDIR="\"/usr/contrib/lib/engines\"" -DPERL5 -DL_ENDIAN -DTERMIOS -fomit-frame-pointer -O2 -march=i486 -Wall -g -fPIC -Iinclude -I. -Icrypto/include -- crypto/aes/aes_cfb.c  2>/dev/null
perl -i -pe 's/^.*\|//; s/ \/(\\.|[^ ])*//;               # $_ = undef if (/: *$/ || /^(#.*| *)$/); # $_.="\n" unless !defined($_) or /\R$/g;' crypto/aes/aes_cfb.d.tmp    


>
> And then, copy-n-paste only the makedepend command and execute it, and
> send me the resulting crypto/aes/aes_cfb.d.tmp as an attachment.  I
> want to see its exact content to see what perl does wrong.
>


The crypto/aes/aes_cfb.d.tmp is just a blank file

cat crypto/aes/aes_cfb.d.tmp
cat: crypto/aes/aes_cfb.d.tmp: No such file or directory    

Next?
 
> Cheers,
> Richard
>
> --
> Richard Levitte         [hidden email]
> OpenSSL Project         http://www.openssl.org/~levitte/
> --
> openssl-dev mailing list
> To unsubscribe: https://mta.openssl.org/mailman/listinfo/openssl-dev

--
Member - Liberal International This is doctor@@nl2k.ab.ca Ici doctor@@nl2k.ab.ca
God,Queen and country!Never Satan President Republic!Beware AntiChrist rising!
http://www.fullyfollow.me/rootnl2k  Look at Psalms 14 and 53 on Atheism
Manitoba and Saskatchewan! Save your provinces in April! Vote Liberal!!
--
openssl-dev mailing list
To unsubscribe: https://mta.openssl.org/mailman/listinfo/openssl-dev
Reply | Threaded
Open this post in threaded view
|

Re: Openssl-SNAP-20160315 issue Re: Openssl-SNAP-20160314 Re: Openssl SNAP 20160313 issue Re: OPenSSL SNAP 20160312 issue

Richard Levitte - VMS Whacker-2
In message <[hidden email]> on Tue, 15 Mar 2016 14:50:22 -0600, The Doctor <[hidden email]> said:

doctor> On Tue, Mar 15, 2016 at 09:22:49PM +0100, Richard Levitte wrote:
doctor> > In message <[hidden email]> on Tue, 15 Mar 2016 14:01:07 -0600, The Doctor <[hidden email]> said:
doctor> >
doctor> > doctor> On Tue, Mar 15, 2016 at 06:09:08PM +0100, Richard Levitte wrote:
doctor> > doctor> > In message <[hidden email]> on Tue, 15 Mar 2016 09:32:42 -0600, The Doctor <[hidden email]> said:
doctor> > doctor> >
doctor> > doctor> > doctor> On Mon, Mar 14, 2016 at 09:02:56AM -0600, The Doctor wrote:
doctor> > doctor> > doctor> > //usr/source/openssl-SNAP-20160314$ make
doctor> > doctor> > doctor> > make: don't know how to make crypto/aes/aes_cfb.o:crypto/aes/aes_cfb.o:. Stop
doctor> > doctor> > doctor> >
doctor> > doctor> > doctor> > I got a bit compiled until this happened.
doctor> > doctor> > doctor> >
doctor> > doctor> > doctor> > Last working package was
doctor> > doctor> > doctor> >
doctor> > doctor> > doctor> > openssl-SNAP-20160311 .
doctor> > doctor> > doctor> >
doctor> > doctor> > doctor>
doctor> > doctor> > doctor> Still the same issue with openssl-SNAP-20160315 .
doctor> > doctor> > doctor>
doctor> > doctor> > doctor> What is the problem with  crypto/aes/aes_cfb.o
doctor> > doctor> > doctor> ??
doctor> > doctor> >
doctor> > doctor> > Hmmm, the seems like an issue with dependency making, somehow.
doctor> > doctor> >
doctor> > doctor> > could you run this command and send me the result (I hope your grep
doctor> > doctor> > understands -A and -B, which is used to display a number of lines
doctor> > doctor> > After and Before a match)?
doctor> > doctor> >
doctor> > doctor> > $ grep -A5 -B5 aes_cfb.o:crypto Makefile
doctor> > doctor> >
doctor> > doctor>
doctor> > doctor> The result is
doctor> > doctor>
doctor> > doctor> crypto/comp/c_zlib.o:crypto/comp/c_zlib.o: crypto/comp/comp_lcl.h
doctor> > doctor> # DO NOT DELETE
doctor> > doctor>
doctor> > doctor> crypto/aes/aes_cfb.o: include/openssl/aes.h
doctor> > doctor> crypto/aes/aes_cfb.o: include/openssl/opensslconf.h
doctor> > doctor> crypto/aes/aes_cfb.o:crypto/aes/aes_cfb.o:crypto/aes/aes_cfb.o: include/openssl/modes.h
doctor> > doctor> # DO NOT DELETE
doctor> > doctor>
doctor> > doctor> crypto/asn1/asn_mstbl.o:crypto/asn1/asn_mstbl.o:crypto/asn1/asn_mstbl.o:crypto/asn1/asn_mstbl.o:crypto/asn1/asn_mstbl.o:crypto/asn1/asn_mstbl.o:crypto/asn1/asn_mstbl.o:crypto/asn1/asn_mstbl.o:crypto/asn1/asn_mstbl.o:crypto/asn1/asn_mstbl.o:crypto/asn1/asn_mstbl.o: include/openssl/crypto.h
doctor> > doctor> crypto/asn1/asn_mstbl.o:crypto/asn1/asn_mstbl.o:crypto/asn1/asn_mstbl.o:crypto/asn1/asn_mstbl.o: include/openssl/e_os2.h
doctor> > doctor> crypto/asn1/asn_mstbl.o: include/openssl/opensslconf.h
doctor> >
doctor> > Ok, that's what I expected.  So there seems to be some odd interaction
doctor> > between the makedepend and the post-processing perl snippet.
doctor> >
doctor> > Could you do the following for me?
doctor> >
doctor> > $ rm crypto/aes/aes_cfb.d
doctor> > $ make crypto/aes/aes_cfb.d
doctor>
doctor> We get
doctor>
doctor> /usr/X11/bin/makedepend -fcrypto/aes/aes_cfb.d.tmp -o"|crypto/aes/aes_cfb.o" -- -DZLIB_SHARED -DDSO_DLFCN -DHAVE_DLFCN_H -DOPENSSL_THREADS -DOPENSSL_NO_STATIC_ENGINE -DOPENSSL_PIC -DOPENSSL_BN_ASM_PART_WORDS -DOPENSSL_BN_ASM_MONT -DOPENSSL_BN_ASM_GF2m -DSHA1_ASM -DSHA256_ASM -DSHA512_ASM -DMD5_ASM -DRMD160_ASM -DAES_ASM -DGHASH_ASM -DECP_NISTZ256_ASM -DPOLY1305_ASM -DOPENSSLDIR="\"/usr/contrib\"" -DENGINESDIR="\"/usr/contrib/lib/engines\"" -DPERL5 -DL_ENDIAN -DTERMIOS -fomit-frame-pointer -O2 -march=i486 -Wall -g -fPIC -Iinclude -I. -Icrypto/include -- crypto/aes/aes_cfb.c  2>/dev/null
doctor> perl -i -pe 's/^.*\|//; s/ \/(\\.|[^ ])*//;               # $_ = undef if (/: *$/ || /^(#.*| *)$/); # $_.="\n" unless !defined($_) or /\R$/g;' crypto/aes/aes_cfb.d.tmp    

Actually, that perl line explained the issue just fine.  Thanks, I
know how to resolve this.

--
Richard Levitte         [hidden email]
OpenSSL Project         http://www.openssl.org/~levitte/
--
openssl-dev mailing list
To unsubscribe: https://mta.openssl.org/mailman/listinfo/openssl-dev
Reply | Threaded
Open this post in threaded view
|

Re: Openssl-SNAP-20160315 issue Re: Openssl-SNAP-20160314 Re: Openssl SNAP 20160313 issue Re: OPenSSL SNAP 20160312 issue

The Doctor
On Tue, Mar 15, 2016 at 10:13:50PM +0100, Richard Levitte wrote:

> In message <[hidden email]> on Tue, 15 Mar 2016 14:50:22 -0600, The Doctor <[hidden email]> said:
>
> doctor> On Tue, Mar 15, 2016 at 09:22:49PM +0100, Richard Levitte wrote:
> doctor> > In message <[hidden email]> on Tue, 15 Mar 2016 14:01:07 -0600, The Doctor <[hidden email]> said:
> doctor> >
> doctor> > doctor> On Tue, Mar 15, 2016 at 06:09:08PM +0100, Richard Levitte wrote:
> doctor> > doctor> > In message <[hidden email]> on Tue, 15 Mar 2016 09:32:42 -0600, The Doctor <[hidden email]> said:
> doctor> > doctor> >
> doctor> > doctor> > doctor> On Mon, Mar 14, 2016 at 09:02:56AM -0600, The Doctor wrote:
> doctor> > doctor> > doctor> > //usr/source/openssl-SNAP-20160314$ make
> doctor> > doctor> > doctor> > make: don't know how to make crypto/aes/aes_cfb.o:crypto/aes/aes_cfb.o:. Stop
> doctor> > doctor> > doctor> >
> doctor> > doctor> > doctor> > I got a bit compiled until this happened.
> doctor> > doctor> > doctor> >
> doctor> > doctor> > doctor> > Last working package was
> doctor> > doctor> > doctor> >
> doctor> > doctor> > doctor> > openssl-SNAP-20160311 .
> doctor> > doctor> > doctor> >
> doctor> > doctor> > doctor>
> doctor> > doctor> > doctor> Still the same issue with openssl-SNAP-20160315 .
> doctor> > doctor> > doctor>
> doctor> > doctor> > doctor> What is the problem with  crypto/aes/aes_cfb.o
> doctor> > doctor> > doctor> ??
> doctor> > doctor> >
> doctor> > doctor> > Hmmm, the seems like an issue with dependency making, somehow.
> doctor> > doctor> >
> doctor> > doctor> > could you run this command and send me the result (I hope your grep
> doctor> > doctor> > understands -A and -B, which is used to display a number of lines
> doctor> > doctor> > After and Before a match)?
> doctor> > doctor> >
> doctor> > doctor> > $ grep -A5 -B5 aes_cfb.o:crypto Makefile
> doctor> > doctor> >
> doctor> > doctor>
> doctor> > doctor> The result is
> doctor> > doctor>
> doctor> > doctor> crypto/comp/c_zlib.o:crypto/comp/c_zlib.o: crypto/comp/comp_lcl.h
> doctor> > doctor> # DO NOT DELETE
> doctor> > doctor>
> doctor> > doctor> crypto/aes/aes_cfb.o: include/openssl/aes.h
> doctor> > doctor> crypto/aes/aes_cfb.o: include/openssl/opensslconf.h
> doctor> > doctor> crypto/aes/aes_cfb.o:crypto/aes/aes_cfb.o:crypto/aes/aes_cfb.o: include/openssl/modes.h
> doctor> > doctor> # DO NOT DELETE
> doctor> > doctor>
> doctor> > doctor> crypto/asn1/asn_mstbl.o:crypto/asn1/asn_mstbl.o:crypto/asn1/asn_mstbl.o:crypto/asn1/asn_mstbl.o:crypto/asn1/asn_mstbl.o:crypto/asn1/asn_mstbl.o:crypto/asn1/asn_mstbl.o:crypto/asn1/asn_mstbl.o:crypto/asn1/asn_mstbl.o:crypto/asn1/asn_mstbl.o:crypto/asn1/asn_mstbl.o: include/openssl/crypto.h
> doctor> > doctor> crypto/asn1/asn_mstbl.o:crypto/asn1/asn_mstbl.o:crypto/asn1/asn_mstbl.o:crypto/asn1/asn_mstbl.o: include/openssl/e_os2.h
> doctor> > doctor> crypto/asn1/asn_mstbl.o: include/openssl/opensslconf.h
> doctor> >
> doctor> > Ok, that's what I expected.  So there seems to be some odd interaction
> doctor> > between the makedepend and the post-processing perl snippet.
> doctor> >
> doctor> > Could you do the following for me?
> doctor> >
> doctor> > $ rm crypto/aes/aes_cfb.d
> doctor> > $ make crypto/aes/aes_cfb.d
> doctor>
> doctor> We get
> doctor>
> doctor> /usr/X11/bin/makedepend -fcrypto/aes/aes_cfb.d.tmp -o"|crypto/aes/aes_cfb.o" -- -DZLIB_SHARED -DDSO_DLFCN -DHAVE_DLFCN_H -DOPENSSL_THREADS -DOPENSSL_NO_STATIC_ENGINE -DOPENSSL_PIC -DOPENSSL_BN_ASM_PART_WORDS -DOPENSSL_BN_ASM_MONT -DOPENSSL_BN_ASM_GF2m -DSHA1_ASM -DSHA256_ASM -DSHA512_ASM -DMD5_ASM -DRMD160_ASM -DAES_ASM -DGHASH_ASM -DECP_NISTZ256_ASM -DPOLY1305_ASM -DOPENSSLDIR="\"/usr/contrib\"" -DENGINESDIR="\"/usr/contrib/lib/engines\"" -DPERL5 -DL_ENDIAN -DTERMIOS -fomit-frame-pointer -O2 -march=i486 -Wall -g -fPIC -Iinclude -I. -Icrypto/include -- crypto/aes/aes_cfb.c  2>/dev/null
> doctor> perl -i -pe 's/^.*\|//; s/ \/(\\.|[^ ])*//;               # $_ = undef if (/: *$/ || /^(#.*| *)$/); # $_.="\n" unless !defined($_) or /\R$/g;' crypto/aes/aes_cfb.d.tmp    
>
> Actually, that perl line explained the issue just fine.  Thanks, I
> know how to resolve this.
>
Just looked atthe Makefile.

May I suggest instead of using perl, use -${PERL} instead.

When I did a symbolic like to perl, that worked

Also  from my non-root account

HARNESS_VERBOSE=yes make tests TESTS='test_evp test_packet test_cms'          

yielded

../test/recipes/30-test_evp.t .....
1..1
Test line 2548: unexpected error KEY_MISMATCH
Expected: 77D6576238657B203B19CA42C18A0497F16B4844E3074AE8DFDFFA3FEDE21442FCD0069DED0948F8326A753A0FC81F17E8D3E0FB2E0D3628CF35E20C38D18906
Got:      1E206D019AE5CD5575A1CD9BD56AF7AF094ACC8A903E163BF22A417CC7073B7B864FE17944690473DBED7E2FAA5A42069150BE9FF727AC1A251E04E52537B961
Test line 2556: unexpected error KEY_MISMATCH
Expected: FDBABE1C9D3472007856E7190D01E9FE7C6AD7CBC8237830E77376634B3731622EAF30D92E22A3886FF109279D9830DAC727AFB94A83EE6D8360CBDFA2CC0640
Got:      4D0B8D57109EF588586B7812B70CD2FBD4DDE5F9AD1E45A17C565E24FE247DE986CA22CFDFF6C64346C62436F301EAE987A0E424B080EACB04E70830C3B9ACE0
Test line 2564: unexpected error KEY_MISMATCH
Expected: 7023BDCB3AFD7348461C06CD81FD38EBFDA8FBBA904F8E3EA9B543F6545DA1F2D5432955613F0FCF62D49705242A9AF9E61E85DC0D651E40DFCF017B45575887
Got:      BF7268686B9059DAA738213780F8EEE8BC2FDD65D50DE1298B5ED2142040DB72E0CC5C6649C682EB8BC998A70D1CA8BCB73FF7367C1027403201F663239520D6
480 tests completed with 3 errors, 0 skipped
not ok 1 - running evp_test evptests.txt

#   Failed test 'running evp_test evptests.txt'
#   at ../test/recipes/30-test_evp.t line 11.
# Looks like you failed 1 test of 1.
Dubious, test returned 1 (wstat 256, 0x100)
Failed 1/1 subtests
../test/recipes/70-test_packet.t ..
1..1
test_PACKET_buf_init() failed
not ok 1 - running packettest

#   Failed test 'running packettest'
#   at ../test/testlib/OpenSSL/Test/Simple.pm line 70.
# Looks like you failed 1 test of 1.
Dubious, test returned 1 (wstat 256, 0x100)
Failed 1/1 subtests
../test/recipes/80-test_cms.t .....
1..4
    1..15
Verification successful
    ok 1 - signed content DER format, RSA key
Verification successful
    ok 2 - signed detached content DER format, RSA key
Verification successful
    ok 3 - signed content test streaming BER format, RSA
Verification successful
    ok 4 - signed content DER format, DSA key
Verification successful
    ok 5 - signed detached content DER format, DSA key
Verification successful
    ok 6 - signed detached content DER format, add RSA signer
Verification successful
    ok 7 - signed content test streaming BER format, DSA key
Verification successful
    ok 8 - signed content test streaming BER format, 2 DSA and 2 RSA keys
Verification successful
    ok 9 - signed content test streaming BER format, 2 DSA and 2 RSA keys, no attributes
Verification successful
    ok 10 - signed content test streaming S/MIME format, 2 DSA and 2 RSA keys
Verification successful
    ok 11 - signed content test streaming multipart S/MIME format, 2 DSA and 2 RSA keys
    ok 12 - enveloped content test streaming S/MIME format, 3 recipients
    ok 13 - enveloped content test streaming S/MIME format, 3 recipients, 3rd used
    ok 14 - enveloped content test streaming S/MIME format, 3 recipients, key only used
    ok 15 - enveloped content test streaming S/MIME format, AES-256 cipher, 3 recipients
ok 1 - CMS => PKCS\#7 compatibility tests
#
    1..15
Verification successful
    ok 1 - signed content DER format, RSA key
Verification successful
    ok 2 - signed detached content DER format, RSA key
Verification successful
    ok 3 - signed content test streaming BER format, RSA
Verification successful
    ok 4 - signed content DER format, DSA key
Verification successful
    ok 5 - signed detached content DER format, DSA key
Verification successful
    ok 6 - signed detached content DER format, add RSA signer
Verification successful
    ok 7 - signed content test streaming BER format, DSA key
Verification successful
    ok 8 - signed content test streaming BER format, 2 DSA and 2 RSA keys
Verification successful
    ok 9 - signed content test streaming BER format, 2 DSA and 2 RSA keys, no attributes
Verification successful
    ok 10 - signed content test streaming S/MIME format, 2 DSA and 2 RSA keys
Verification successful
    ok 11 - signed content test streaming multipart S/MIME format, 2 DSA and 2 RSA keys
    ok 12 - enveloped content test streaming S/MIME format, 3 recipients
    ok 13 - enveloped content test streaming S/MIME format, 3 recipients, 3rd used
    ok 14 - enveloped content test streaming S/MIME format, 3 recipients, key only used
    ok 15 - enveloped content test streaming S/MIME format, AES-256 cipher, 3 recipients
ok 2 - CMS <= PKCS\#7 compatibility tests
#
    1..27
Verification successful
    ok 1 - signed content DER format, RSA key
Verification successful
    ok 2 - signed detached content DER format, RSA key
Verification successful
    ok 3 - signed content test streaming BER format, RSA
Verification successful
    ok 4 - signed content DER format, DSA key
Verification successful
    ok 5 - signed detached content DER format, DSA key
Verification successful
    ok 6 - signed detached content DER format, add RSA signer
Verification successful
    ok 7 - signed content test streaming BER format, DSA key
Verification successful
    ok 8 - signed content test streaming BER format, 2 DSA and 2 RSA keys
Verification successful
    ok 9 - signed content test streaming BER format, 2 DSA and 2 RSA keys, no attributes
Verification successful
    ok 10 - signed content test streaming S/MIME format, 2 DSA and 2 RSA keys
Verification successful
    ok 11 - signed content test streaming multipart S/MIME format, 2 DSA and 2 RSA keys
    ok 12 - enveloped content test streaming S/MIME format, 3 recipients
    ok 13 - enveloped content test streaming S/MIME format, 3 recipients, 3rd used
    ok 14 - enveloped content test streaming S/MIME format, 3 recipients, key only used
    ok 15 - enveloped content test streaming S/MIME format, AES-256 cipher, 3 recipients
Verification successful
    ok 16 - signed content test streaming BER format, 2 DSA and 2 RSA keys, keyid
Verification successful
    ok 17 - signed content test streaming PEM format, 2 DSA and 2 RSA keys
Verification successful
    ok 18 - signed content MIME format, RSA key, signed receipt request
Verification successful
    ok 19 - signed receipt MIME format, RSA key
    ok 20 - enveloped content test streaming S/MIME format, 3 recipients, keyid
    ok 21 - enveloped content test streaming PEM format, KEK
    ok 22 - enveloped content test streaming PEM format, KEK, key only
    ok 23 - data content test streaming PEM format
    ok 24 - encrypted content test streaming PEM format, 128 bit RC2 key
    ok 25 - encrypted content test streaming PEM format, 40 bit RC2 key
    ok 26 - encrypted content test streaming PEM format, triple DES key
    ok 27 - encrypted content test streaming PEM format, 128 bit AES key
ok 3 - CMS <=> CMS consistency tests
#
    1..11
Verification successful
    ok 1 - signed content test streaming PEM format, RSA keys, PSS signature
Verification successful
    ok 2 - signed content test streaming PEM format, RSA keys, PSS signature, no attributes
Verification successful
    ok 3 - signed content test streaming PEM format, RSA keys, PSS signature, SHA384 MGF1
    ok 4 - enveloped content test streaming S/MIME format, OAEP default parameters
    ok 5 - enveloped content test streaming S/MIME format, OAEP SHA256
    ok 6 - enveloped content test streaming S/MIME format, ECDH
    ok 7 - enveloped content test streaming S/MIME format, ECDH, key identifier
    ok 8 - enveloped content test streaming S/MIME format, ECDH, AES128, SHA256 KDF
    ok 9 - enveloped content test streaming S/MIME format, ECDH, K-283, cofactor DH
    ok 10 - enveloped content test streaming S/MIME format, X9.42 DH
Error creating CMS structure
135045376:error:2E068097:CMS routines:CMS_compress:unsupported compression algorithm:crypto/cms/cms_smime.c:879:
    not ok 11 - compressed content test streaming PEM format

    #   Failed test 'compressed content test streaming PEM format'
    #   at ../test/recipes/80-test_cms.t line 452.
    # Looks like you failed 1 test of 11.
not ok 4 - CMS <=> CMS consistency tests, modified key parameters
#

#   Failed test 'CMS <=> CMS consistency tests, modified key parameters
# '
#   at ../test/recipes/80-test_cms.t line 458.
# Looks like you failed 1 test of 4.
Dubious, test returned 1 (wstat 256, 0x100)
Failed 1/4 subtests

Test Summary Report
-------------------
../test/recipes/30-test_evp.t   (Wstat: 256 Tests: 1 Failed: 1)
  Failed test:  1
  Non-zero exit status: 1
../test/recipes/70-test_packet.t (Wstat: 256 Tests: 1 Failed: 1)
  Failed test:  1
  Non-zero exit status: 1
../test/recipes/80-test_cms.t   (Wstat: 256 Tests: 4 Failed: 1)
  Failed test:  4
  Non-zero exit status: 1
Files=3, Tests=6, 24 wallclock secs ( 0.15 usr  0.08 sys + 12.15 cusr 15.10 csys = 27.48 CPU)
Result: FAIL
Failed 3/3 test programs. 3/6 subtests failed.
*** Error code 1

Stop.                                              

The rest was fine.
 
> --
> Richard Levitte         [hidden email]
> OpenSSL Project         http://www.openssl.org/~levitte/
> --
> openssl-dev mailing list
> To unsubscribe: https://mta.openssl.org/mailman/listinfo/openssl-dev

--
Member - Liberal International This is doctor@@nl2k.ab.ca Ici doctor@@nl2k.ab.ca
God,Queen and country!Never Satan President Republic!Beware AntiChrist rising!
http://www.fullyfollow.me/rootnl2k  Look at Psalms 14 and 53 on Atheism
Manitoba and Saskatchewan! Save your provinces in April! Vote Liberal!!
--
openssl-dev mailing list
To unsubscribe: https://mta.openssl.org/mailman/listinfo/openssl-dev
Reply | Threaded
Open this post in threaded view
|

Re: Openssl-SNAP-20160315 issue Re: Openssl-SNAP-20160314 Re: Openssl SNAP 20160313 issue Re: OPenSSL SNAP 20160312 issue

Richard Levitte - VMS Whacker-2
In message <[hidden email]> on Wed, 16 Mar 2016 12:26:29 -0600, The Doctor <[hidden email]> said:

doctor> On Tue, Mar 15, 2016 at 10:13:50PM +0100, Richard Levitte wrote:
doctor> > In message <[hidden email]> on Tue, 15 Mar 2016 14:50:22 -0600, The Doctor <[hidden email]> said:
doctor> > doctor> perl -i -pe 's/^.*\|//; s/ \/(\\.|[^ ])*//;               # $_ = undef if (/: *$/ || /^(#.*| *)$/); # $_.="\n" unless !defined($_) or /\R$/g;' crypto/aes/aes_cfb.d.tmp    
doctor> >
doctor> > Actually, that perl line explained the issue just fine.  Thanks, I
doctor> > know how to resolve this.
doctor> >
doctor> Just looked atthe Makefile.
doctor>
doctor> May I suggest instead of using perl, use -${PERL} instead.

Good idea, I'll fix that.

doctor> When I did a symbolic like to perl, that worked
doctor>
doctor> Also  from my non-root account
doctor>
doctor> HARNESS_VERBOSE=yes make tests TESTS='test_evp test_packet test_cms'          
doctor>
doctor> yielded
doctor>
doctor> ../test/recipes/30-test_evp.t .....
doctor> 1..1
doctor> Test line 2548: unexpected error KEY_MISMATCH
doctor> Expected: 77D6576238657B203B19CA42C18A0497F16B4844E3074AE8DFDFFA3FEDE21442FCD0069DED0948F8326A753A0FC81F17E8D3E0FB2E0D3628CF35E20C38D18906
doctor> Got:      1E206D019AE5CD5575A1CD9BD56AF7AF094ACC8A903E163BF22A417CC7073B7B864FE17944690473DBED7E2FAA5A42069150BE9FF727AC1A251E04E52537B961
doctor> Test line 2556: unexpected error KEY_MISMATCH
doctor> Expected: FDBABE1C9D3472007856E7190D01E9FE7C6AD7CBC8237830E77376634B3731622EAF30D92E22A3886FF109279D9830DAC727AFB94A83EE6D8360CBDFA2CC0640
doctor> Got:      4D0B8D57109EF588586B7812B70CD2FBD4DDE5F9AD1E45A17C565E24FE247DE986CA22CFDFF6C64346C62436F301EAE987A0E424B080EACB04E70830C3B9ACE0
doctor> Test line 2564: unexpected error KEY_MISMATCH
doctor> Expected: 7023BDCB3AFD7348461C06CD81FD38EBFDA8FBBA904F8E3EA9B543F6545DA1F2D5432955613F0FCF62D49705242A9AF9E61E85DC0D651E40DFCF017B45575887
doctor> Got:      BF7268686B9059DAA738213780F8EEE8BC2FDD65D50DE1298B5ED2142040DB72E0CC5C6649C682EB8BC998A70D1CA8BCB73FF7367C1027403201F663239520D6
doctor> 480 tests completed with 3 errors, 0 skipped
doctor> not ok 1 - running evp_test evptests.txt
doctor>
doctor> #   Failed test 'running evp_test evptests.txt'
doctor> #   at ../test/recipes/30-test_evp.t line 11.
doctor> # Looks like you failed 1 test of 1.
doctor> Dubious, test returned 1 (wstat 256, 0x100)
doctor> Failed 1/1 subtests
doctor> ../test/recipes/70-test_packet.t ..
doctor> 1..1
doctor> test_PACKET_buf_init() failed
doctor> not ok 1 - running packettest
doctor>
doctor> #   Failed test 'running packettest'
doctor> #   at ../test/testlib/OpenSSL/Test/Simple.pm line 70.
doctor> # Looks like you failed 1 test of 1.
doctor> Dubious, test returned 1 (wstat 256, 0x100)
doctor> Failed 1/1 subtests
doctor> ../test/recipes/80-test_cms.t .....
doctor> 1..4
doctor>     1..15
doctor> Verification successful
doctor>     ok 1 - signed content DER format, RSA key
doctor> Verification successful
doctor>     ok 2 - signed detached content DER format, RSA key
doctor> Verification successful
doctor>     ok 3 - signed content test streaming BER format, RSA
doctor> Verification successful
doctor>     ok 4 - signed content DER format, DSA key
doctor> Verification successful
doctor>     ok 5 - signed detached content DER format, DSA key
doctor> Verification successful
doctor>     ok 6 - signed detached content DER format, add RSA signer
doctor> Verification successful
doctor>     ok 7 - signed content test streaming BER format, DSA key
doctor> Verification successful
doctor>     ok 8 - signed content test streaming BER format, 2 DSA and 2 RSA keys
doctor> Verification successful
doctor>     ok 9 - signed content test streaming BER format, 2 DSA and 2 RSA keys, no attributes
doctor> Verification successful
doctor>     ok 10 - signed content test streaming S/MIME format, 2 DSA and 2 RSA keys
doctor> Verification successful
doctor>     ok 11 - signed content test streaming multipart S/MIME format, 2 DSA and 2 RSA keys
doctor>     ok 12 - enveloped content test streaming S/MIME format, 3 recipients
doctor>     ok 13 - enveloped content test streaming S/MIME format, 3 recipients, 3rd used
doctor>     ok 14 - enveloped content test streaming S/MIME format, 3 recipients, key only used
doctor>     ok 15 - enveloped content test streaming S/MIME format, AES-256 cipher, 3 recipients
doctor> ok 1 - CMS => PKCS\#7 compatibility tests
doctor> #
doctor>     1..15
doctor> Verification successful
doctor>     ok 1 - signed content DER format, RSA key
doctor> Verification successful
doctor>     ok 2 - signed detached content DER format, RSA key
doctor> Verification successful
doctor>     ok 3 - signed content test streaming BER format, RSA
doctor> Verification successful
doctor>     ok 4 - signed content DER format, DSA key
doctor> Verification successful
doctor>     ok 5 - signed detached content DER format, DSA key
doctor> Verification successful
doctor>     ok 6 - signed detached content DER format, add RSA signer
doctor> Verification successful
doctor>     ok 7 - signed content test streaming BER format, DSA key
doctor> Verification successful
doctor>     ok 8 - signed content test streaming BER format, 2 DSA and 2 RSA keys
doctor> Verification successful
doctor>     ok 9 - signed content test streaming BER format, 2 DSA and 2 RSA keys, no attributes
doctor> Verification successful
doctor>     ok 10 - signed content test streaming S/MIME format, 2 DSA and 2 RSA keys
doctor> Verification successful
doctor>     ok 11 - signed content test streaming multipart S/MIME format, 2 DSA and 2 RSA keys
doctor>     ok 12 - enveloped content test streaming S/MIME format, 3 recipients
doctor>     ok 13 - enveloped content test streaming S/MIME format, 3 recipients, 3rd used
doctor>     ok 14 - enveloped content test streaming S/MIME format, 3 recipients, key only used
doctor>     ok 15 - enveloped content test streaming S/MIME format, AES-256 cipher, 3 recipients
doctor> ok 2 - CMS <= PKCS\#7 compatibility tests
doctor> #
doctor>     1..27
doctor> Verification successful
doctor>     ok 1 - signed content DER format, RSA key
doctor> Verification successful
doctor>     ok 2 - signed detached content DER format, RSA key
doctor> Verification successful
doctor>     ok 3 - signed content test streaming BER format, RSA
doctor> Verification successful
doctor>     ok 4 - signed content DER format, DSA key
doctor> Verification successful
doctor>     ok 5 - signed detached content DER format, DSA key
doctor> Verification successful
doctor>     ok 6 - signed detached content DER format, add RSA signer
doctor> Verification successful
doctor>     ok 7 - signed content test streaming BER format, DSA key
doctor> Verification successful
doctor>     ok 8 - signed content test streaming BER format, 2 DSA and 2 RSA keys
doctor> Verification successful
doctor>     ok 9 - signed content test streaming BER format, 2 DSA and 2 RSA keys, no attributes
doctor> Verification successful
doctor>     ok 10 - signed content test streaming S/MIME format, 2 DSA and 2 RSA keys
doctor> Verification successful
doctor>     ok 11 - signed content test streaming multipart S/MIME format, 2 DSA and 2 RSA keys
doctor>     ok 12 - enveloped content test streaming S/MIME format, 3 recipients
doctor>     ok 13 - enveloped content test streaming S/MIME format, 3 recipients, 3rd used
doctor>     ok 14 - enveloped content test streaming S/MIME format, 3 recipients, key only used
doctor>     ok 15 - enveloped content test streaming S/MIME format, AES-256 cipher, 3 recipients
doctor> Verification successful
doctor>     ok 16 - signed content test streaming BER format, 2 DSA and 2 RSA keys, keyid
doctor> Verification successful
doctor>     ok 17 - signed content test streaming PEM format, 2 DSA and 2 RSA keys
doctor> Verification successful
doctor>     ok 18 - signed content MIME format, RSA key, signed receipt request
doctor> Verification successful
doctor>     ok 19 - signed receipt MIME format, RSA key
doctor>     ok 20 - enveloped content test streaming S/MIME format, 3 recipients, keyid
doctor>     ok 21 - enveloped content test streaming PEM format, KEK
doctor>     ok 22 - enveloped content test streaming PEM format, KEK, key only
doctor>     ok 23 - data content test streaming PEM format
doctor>     ok 24 - encrypted content test streaming PEM format, 128 bit RC2 key
doctor>     ok 25 - encrypted content test streaming PEM format, 40 bit RC2 key
doctor>     ok 26 - encrypted content test streaming PEM format, triple DES key
doctor>     ok 27 - encrypted content test streaming PEM format, 128 bit AES key
doctor> ok 3 - CMS <=> CMS consistency tests
doctor> #
doctor>     1..11
doctor> Verification successful
doctor>     ok 1 - signed content test streaming PEM format, RSA keys, PSS signature
doctor> Verification successful
doctor>     ok 2 - signed content test streaming PEM format, RSA keys, PSS signature, no attributes
doctor> Verification successful
doctor>     ok 3 - signed content test streaming PEM format, RSA keys, PSS signature, SHA384 MGF1
doctor>     ok 4 - enveloped content test streaming S/MIME format, OAEP default parameters
doctor>     ok 5 - enveloped content test streaming S/MIME format, OAEP SHA256
doctor>     ok 6 - enveloped content test streaming S/MIME format, ECDH
doctor>     ok 7 - enveloped content test streaming S/MIME format, ECDH, key identifier
doctor>     ok 8 - enveloped content test streaming S/MIME format, ECDH, AES128, SHA256 KDF
doctor>     ok 9 - enveloped content test streaming S/MIME format, ECDH, K-283, cofactor DH
doctor>     ok 10 - enveloped content test streaming S/MIME format, X9.42 DH
doctor> Error creating CMS structure
doctor> 135045376:error:2E068097:CMS routines:CMS_compress:unsupported compression algorithm:crypto/cms/cms_smime.c:879:
doctor>     not ok 11 - compressed content test streaming PEM format
doctor>
doctor>     #   Failed test 'compressed content test streaming PEM format'
doctor>     #   at ../test/recipes/80-test_cms.t line 452.
doctor>     # Looks like you failed 1 test of 11.
doctor> not ok 4 - CMS <=> CMS consistency tests, modified key parameters
doctor> #
doctor>
doctor> #   Failed test 'CMS <=> CMS consistency tests, modified key parameters
doctor> # '
doctor> #   at ../test/recipes/80-test_cms.t line 458.
doctor> # Looks like you failed 1 test of 4.
doctor> Dubious, test returned 1 (wstat 256, 0x100)
doctor> Failed 1/4 subtests
doctor>
doctor> Test Summary Report
doctor> -------------------
doctor> ../test/recipes/30-test_evp.t   (Wstat: 256 Tests: 1 Failed: 1)
doctor>   Failed test:  1
doctor>   Non-zero exit status: 1
doctor> ../test/recipes/70-test_packet.t (Wstat: 256 Tests: 1 Failed: 1)
doctor>   Failed test:  1
doctor>   Non-zero exit status: 1
doctor> ../test/recipes/80-test_cms.t   (Wstat: 256 Tests: 4 Failed: 1)
doctor>   Failed test:  4
doctor>   Non-zero exit status: 1
doctor> Files=3, Tests=6, 24 wallclock secs ( 0.15 usr  0.08 sys + 12.15 cusr 15.10 csys = 27.48 CPU)
doctor> Result: FAIL
doctor> Failed 3/3 test programs. 3/6 subtests failed.
doctor> *** Error code 1
doctor>
doctor> Stop.                                              
doctor>
doctor> The rest was fine.

Would you mind submitting an email about these failures to
[hidden email]?

--
Richard Levitte         [hidden email]
OpenSSL Project         http://www.openssl.org/~levitte/
--
openssl-dev mailing list
To unsubscribe: https://mta.openssl.org/mailman/listinfo/openssl-dev
Reply | Threaded
Open this post in threaded view
|

Re: Openssl-SNAP-20160315 issue Re: Openssl-SNAP-20160314 Re: Openssl SNAP 20160313 issue Re: OPenSSL SNAP 20160312 issue

The Doctor
On Wed, Mar 16, 2016 at 08:09:15PM +0100, Richard Levitte wrote:

> In message <[hidden email]> on Wed, 16 Mar 2016 12:26:29 -0600, The Doctor <[hidden email]> said:
>
> doctor> On Tue, Mar 15, 2016 at 10:13:50PM +0100, Richard Levitte wrote:
> doctor> > In message <[hidden email]> on Tue, 15 Mar 2016 14:50:22 -0600, The Doctor <[hidden email]> said:
> doctor> > doctor> perl -i -pe 's/^.*\|//; s/ \/(\\.|[^ ])*//;               # $_ = undef if (/: *$/ || /^(#.*| *)$/); # $_.="\n" unless !defined($_) or /\R$/g;' crypto/aes/aes_cfb.d.tmp    
> doctor> >
> doctor> > Actually, that perl line explained the issue just fine.  Thanks, I
> doctor> > know how to resolve this.
> doctor> >
> doctor> Just looked atthe Makefile.
> doctor>
> doctor> May I suggest instead of using perl, use -${PERL} instead.
>
> Good idea, I'll fix that.
>

And it works!

 

> doctor> When I did a symbolic like to perl, that worked
> doctor>
> doctor> Also  from my non-root account
> doctor>
> doctor> HARNESS_VERBOSE=yes make tests TESTS='test_evp test_packet test_cms'          
> doctor>
> doctor> yielded
> doctor>
> doctor> ../test/recipes/30-test_evp.t .....
> doctor> 1..1
> doctor> Test line 2548: unexpected error KEY_MISMATCH
> doctor> Expected: 77D6576238657B203B19CA42C18A0497F16B4844E3074AE8DFDFFA3FEDE21442FCD0069DED0948F8326A753A0FC81F17E8D3E0FB2E0D3628CF35E20C38D18906
> doctor> Got:      1E206D019AE5CD5575A1CD9BD56AF7AF094ACC8A903E163BF22A417CC7073B7B864FE17944690473DBED7E2FAA5A42069150BE9FF727AC1A251E04E52537B961
> doctor> Test line 2556: unexpected error KEY_MISMATCH
> doctor> Expected: FDBABE1C9D3472007856E7190D01E9FE7C6AD7CBC8237830E77376634B3731622EAF30D92E22A3886FF109279D9830DAC727AFB94A83EE6D8360CBDFA2CC0640
> doctor> Got:      4D0B8D57109EF588586B7812B70CD2FBD4DDE5F9AD1E45A17C565E24FE247DE986CA22CFDFF6C64346C62436F301EAE987A0E424B080EACB04E70830C3B9ACE0
> doctor> Test line 2564: unexpected error KEY_MISMATCH
> doctor> Expected: 7023BDCB3AFD7348461C06CD81FD38EBFDA8FBBA904F8E3EA9B543F6545DA1F2D5432955613F0FCF62D49705242A9AF9E61E85DC0D651E40DFCF017B45575887
> doctor> Got:      BF7268686B9059DAA738213780F8EEE8BC2FDD65D50DE1298B5ED2142040DB72E0CC5C6649C682EB8BC998A70D1CA8BCB73FF7367C1027403201F663239520D6
> doctor> 480 tests completed with 3 errors, 0 skipped
> doctor> not ok 1 - running evp_test evptests.txt
> doctor>
> doctor> #   Failed test 'running evp_test evptests.txt'
> doctor> #   at ../test/recipes/30-test_evp.t line 11.
> doctor> # Looks like you failed 1 test of 1.
> doctor> Dubious, test returned 1 (wstat 256, 0x100)
> doctor> Failed 1/1 subtests
> doctor> ../test/recipes/70-test_packet.t ..
> doctor> 1..1
> doctor> test_PACKET_buf_init() failed
> doctor> not ok 1 - running packettest
> doctor>
> doctor> #   Failed test 'running packettest'
> doctor> #   at ../test/testlib/OpenSSL/Test/Simple.pm line 70.
> doctor> # Looks like you failed 1 test of 1.
> doctor> Dubious, test returned 1 (wstat 256, 0x100)
> doctor> Failed 1/1 subtests
> doctor> ../test/recipes/80-test_cms.t .....
> doctor> 1..4
> doctor>     1..15
> doctor> Verification successful
> doctor>     ok 1 - signed content DER format, RSA key
> doctor> Verification successful
> doctor>     ok 2 - signed detached content DER format, RSA key
> doctor> Verification successful
> doctor>     ok 3 - signed content test streaming BER format, RSA
> doctor> Verification successful
> doctor>     ok 4 - signed content DER format, DSA key
> doctor> Verification successful
> doctor>     ok 5 - signed detached content DER format, DSA key
> doctor> Verification successful
> doctor>     ok 6 - signed detached content DER format, add RSA signer
> doctor> Verification successful
> doctor>     ok 7 - signed content test streaming BER format, DSA key
> doctor> Verification successful
> doctor>     ok 8 - signed content test streaming BER format, 2 DSA and 2 RSA keys
> doctor> Verification successful
> doctor>     ok 9 - signed content test streaming BER format, 2 DSA and 2 RSA keys, no attributes
> doctor> Verification successful
> doctor>     ok 10 - signed content test streaming S/MIME format, 2 DSA and 2 RSA keys
> doctor> Verification successful
> doctor>     ok 11 - signed content test streaming multipart S/MIME format, 2 DSA and 2 RSA keys
> doctor>     ok 12 - enveloped content test streaming S/MIME format, 3 recipients
> doctor>     ok 13 - enveloped content test streaming S/MIME format, 3 recipients, 3rd used
> doctor>     ok 14 - enveloped content test streaming S/MIME format, 3 recipients, key only used
> doctor>     ok 15 - enveloped content test streaming S/MIME format, AES-256 cipher, 3 recipients
> doctor> ok 1 - CMS => PKCS\#7 compatibility tests
> doctor> #
> doctor>     1..15
> doctor> Verification successful
> doctor>     ok 1 - signed content DER format, RSA key
> doctor> Verification successful
> doctor>     ok 2 - signed detached content DER format, RSA key
> doctor> Verification successful
> doctor>     ok 3 - signed content test streaming BER format, RSA
> doctor> Verification successful
> doctor>     ok 4 - signed content DER format, DSA key
> doctor> Verification successful
> doctor>     ok 5 - signed detached content DER format, DSA key
> doctor> Verification successful
> doctor>     ok 6 - signed detached content DER format, add RSA signer
> doctor> Verification successful
> doctor>     ok 7 - signed content test streaming BER format, DSA key
> doctor> Verification successful
> doctor>     ok 8 - signed content test streaming BER format, 2 DSA and 2 RSA keys
> doctor> Verification successful
> doctor>     ok 9 - signed content test streaming BER format, 2 DSA and 2 RSA keys, no attributes
> doctor> Verification successful
> doctor>     ok 10 - signed content test streaming S/MIME format, 2 DSA and 2 RSA keys
> doctor> Verification successful
> doctor>     ok 11 - signed content test streaming multipart S/MIME format, 2 DSA and 2 RSA keys
> doctor>     ok 12 - enveloped content test streaming S/MIME format, 3 recipients
> doctor>     ok 13 - enveloped content test streaming S/MIME format, 3 recipients, 3rd used
> doctor>     ok 14 - enveloped content test streaming S/MIME format, 3 recipients, key only used
> doctor>     ok 15 - enveloped content test streaming S/MIME format, AES-256 cipher, 3 recipients
> doctor> ok 2 - CMS <= PKCS\#7 compatibility tests
> doctor> #
> doctor>     1..27
> doctor> Verification successful
> doctor>     ok 1 - signed content DER format, RSA key
> doctor> Verification successful
> doctor>     ok 2 - signed detached content DER format, RSA key
> doctor> Verification successful
> doctor>     ok 3 - signed content test streaming BER format, RSA
> doctor> Verification successful
> doctor>     ok 4 - signed content DER format, DSA key
> doctor> Verification successful
> doctor>     ok 5 - signed detached content DER format, DSA key
> doctor> Verification successful
> doctor>     ok 6 - signed detached content DER format, add RSA signer
> doctor> Verification successful
> doctor>     ok 7 - signed content test streaming BER format, DSA key
> doctor> Verification successful
> doctor>     ok 8 - signed content test streaming BER format, 2 DSA and 2 RSA keys
> doctor> Verification successful
> doctor>     ok 9 - signed content test streaming BER format, 2 DSA and 2 RSA keys, no attributes
> doctor> Verification successful
> doctor>     ok 10 - signed content test streaming S/MIME format, 2 DSA and 2 RSA keys
> doctor> Verification successful
> doctor>     ok 11 - signed content test streaming multipart S/MIME format, 2 DSA and 2 RSA keys
> doctor>     ok 12 - enveloped content test streaming S/MIME format, 3 recipients
> doctor>     ok 13 - enveloped content test streaming S/MIME format, 3 recipients, 3rd used
> doctor>     ok 14 - enveloped content test streaming S/MIME format, 3 recipients, key only used
> doctor>     ok 15 - enveloped content test streaming S/MIME format, AES-256 cipher, 3 recipients
> doctor> Verification successful
> doctor>     ok 16 - signed content test streaming BER format, 2 DSA and 2 RSA keys, keyid
> doctor> Verification successful
> doctor>     ok 17 - signed content test streaming PEM format, 2 DSA and 2 RSA keys
> doctor> Verification successful
> doctor>     ok 18 - signed content MIME format, RSA key, signed receipt request
> doctor> Verification successful
> doctor>     ok 19 - signed receipt MIME format, RSA key
> doctor>     ok 20 - enveloped content test streaming S/MIME format, 3 recipients, keyid
> doctor>     ok 21 - enveloped content test streaming PEM format, KEK
> doctor>     ok 22 - enveloped content test streaming PEM format, KEK, key only
> doctor>     ok 23 - data content test streaming PEM format
> doctor>     ok 24 - encrypted content test streaming PEM format, 128 bit RC2 key
> doctor>     ok 25 - encrypted content test streaming PEM format, 40 bit RC2 key
> doctor>     ok 26 - encrypted content test streaming PEM format, triple DES key
> doctor>     ok 27 - encrypted content test streaming PEM format, 128 bit AES key
> doctor> ok 3 - CMS <=> CMS consistency tests
> doctor> #
> doctor>     1..11
> doctor> Verification successful
> doctor>     ok 1 - signed content test streaming PEM format, RSA keys, PSS signature
> doctor> Verification successful
> doctor>     ok 2 - signed content test streaming PEM format, RSA keys, PSS signature, no attributes
> doctor> Verification successful
> doctor>     ok 3 - signed content test streaming PEM format, RSA keys, PSS signature, SHA384 MGF1
> doctor>     ok 4 - enveloped content test streaming S/MIME format, OAEP default parameters
> doctor>     ok 5 - enveloped content test streaming S/MIME format, OAEP SHA256
> doctor>     ok 6 - enveloped content test streaming S/MIME format, ECDH
> doctor>     ok 7 - enveloped content test streaming S/MIME format, ECDH, key identifier
> doctor>     ok 8 - enveloped content test streaming S/MIME format, ECDH, AES128, SHA256 KDF
> doctor>     ok 9 - enveloped content test streaming S/MIME format, ECDH, K-283, cofactor DH
> doctor>     ok 10 - enveloped content test streaming S/MIME format, X9.42 DH
> doctor> Error creating CMS structure
> doctor> 135045376:error:2E068097:CMS routines:CMS_compress:unsupported compression algorithm:crypto/cms/cms_smime.c:879:
> doctor>     not ok 11 - compressed content test streaming PEM format
> doctor>
> doctor>     #   Failed test 'compressed content test streaming PEM format'
> doctor>     #   at ../test/recipes/80-test_cms.t line 452.
> doctor>     # Looks like you failed 1 test of 11.
> doctor> not ok 4 - CMS <=> CMS consistency tests, modified key parameters
> doctor> #
> doctor>
> doctor> #   Failed test 'CMS <=> CMS consistency tests, modified key parameters
> doctor> # '
> doctor> #   at ../test/recipes/80-test_cms.t line 458.
> doctor> # Looks like you failed 1 test of 4.
> doctor> Dubious, test returned 1 (wstat 256, 0x100)
> doctor> Failed 1/4 subtests
> doctor>
> doctor> Test Summary Report
> doctor> -------------------
> doctor> ../test/recipes/30-test_evp.t   (Wstat: 256 Tests: 1 Failed: 1)
> doctor>   Failed test:  1
> doctor>   Non-zero exit status: 1
> doctor> ../test/recipes/70-test_packet.t (Wstat: 256 Tests: 1 Failed: 1)
> doctor>   Failed test:  1
> doctor>   Non-zero exit status: 1
> doctor> ../test/recipes/80-test_cms.t   (Wstat: 256 Tests: 4 Failed: 1)
> doctor>   Failed test:  4
> doctor>   Non-zero exit status: 1
> doctor> Files=3, Tests=6, 24 wallclock secs ( 0.15 usr  0.08 sys + 12.15 cusr 15.10 csys = 27.48 CPU)
> doctor> Result: FAIL
> doctor> Failed 3/3 test programs. 3/6 subtests failed.
> doctor> *** Error code 1
> doctor>
> doctor> Stop.                                              
> doctor>
> doctor> The rest was fine.
>
> Would you mind submitting an email about these failures to
> [hidden email]?
>

I will CC openssl-SNAP-20160317 results

../test/recipes/30-test_evp.t .....
1..1
Test line 2548: unexpected error KEY_MISMATCH
Expected: 77D6576238657B203B19CA42C18A0497F16B4844E3074AE8DFDFFA3FEDE21442FCD0069DED0948F8326A753A0FC81F17E8D3E0FB2E0D3628CF35E20C38D18906
Got:      1E206D019AE5CD5575A1CD9BD56AF7AF094ACC8A903E163BF22A417CC7073B7B864FE17944690473DBED7E2FAA5A42069150BE9FF727AC1A251E04E52537B961
Test line 2556: unexpected error KEY_MISMATCH
Expected: FDBABE1C9D3472007856E7190D01E9FE7C6AD7CBC8237830E77376634B3731622EAF30D92E22A3886FF109279D9830DAC727AFB94A83EE6D8360CBDFA2CC0640
Got:      4D0B8D57109EF588586B7812B70CD2FBD4DDE5F9AD1E45A17C565E24FE247DE986CA22CFDFF6C64346C62436F301EAE987A0E424B080EACB04E70830C3B9ACE0
Test line 2564: unexpected error KEY_MISMATCH
Expected: 7023BDCB3AFD7348461C06CD81FD38EBFDA8FBBA904F8E3EA9B543F6545DA1F2D5432955613F0FCF62D49705242A9AF9E61E85DC0D651E40DFCF017B45575887
Got:      BF7268686B9059DAA738213780F8EEE8BC2FDD65D50DE1298B5ED2142040DB72E0CC5C6649C682EB8BC998A70D1CA8BCB73FF7367C1027403201F663239520D6
480 tests completed with 3 errors, 0 skipped
not ok 1 - running evp_test evptests.txt

#   Failed test 'running evp_test evptests.txt'
#   at ../test/recipes/30-test_evp.t line 11.
# Looks like you failed 1 test of 1.
Dubious, test returned 1 (wstat 256, 0x100)
Failed 1/1 subtests
../test/recipes/70-test_packet.t ..
1..1
test_PACKET_buf_init() failed
not ok 1 - running packettest

#   Failed test 'running packettest'
#   at ../test/testlib/OpenSSL/Test/Simple.pm line 70.
# Looks like you failed 1 test of 1.
Dubious, test returned 1 (wstat 256, 0x100)
Failed 1/1 subtests
../test/recipes/80-test_cms.t .....
1..4
    1..15
Verification successful
    ok 1 - signed content DER format, RSA key
Verification successful
    ok 2 - signed detached content DER format, RSA key
Verification successful
    ok 3 - signed content test streaming BER format, RSA
Verification successful
    ok 4 - signed content DER format, DSA key
Verification successful
    ok 5 - signed detached content DER format, DSA key
Verification successful
    ok 6 - signed detached content DER format, add RSA signer
Verification successful
    ok 7 - signed content test streaming BER format, DSA key
Verification successful
    ok 8 - signed content test streaming BER format, 2 DSA and 2 RSA keys
Verification successful
    ok 9 - signed content test streaming BER format, 2 DSA and 2 RSA keys, no attributes
Verification successful
    ok 10 - signed content test streaming S/MIME format, 2 DSA and 2 RSA keys
Verification successful
    ok 11 - signed content test streaming multipart S/MIME format, 2 DSA and 2 RSA keys
    ok 12 - enveloped content test streaming S/MIME format, 3 recipients
    ok 13 - enveloped content test streaming S/MIME format, 3 recipients, 3rd used
    ok 14 - enveloped content test streaming S/MIME format, 3 recipients, key only used
    ok 15 - enveloped content test streaming S/MIME format, AES-256 cipher, 3 recipients
ok 1 - CMS => PKCS\#7 compatibility tests
#
    1..15
Verification successful
    ok 1 - signed content DER format, RSA key
Verification successful
    ok 2 - signed detached content DER format, RSA key
Verification successful
    ok 3 - signed content test streaming BER format, RSA
Verification successful
    ok 4 - signed content DER format, DSA key
Verification successful
    ok 5 - signed detached content DER format, DSA key
Verification successful
    ok 6 - signed detached content DER format, add RSA signer
Verification successful
    ok 7 - signed content test streaming BER format, DSA key
Verification successful
    ok 8 - signed content test streaming BER format, 2 DSA and 2 RSA keys
Verification successful
    ok 9 - signed content test streaming BER format, 2 DSA and 2 RSA keys, no attributes
Verification successful
    ok 10 - signed content test streaming S/MIME format, 2 DSA and 2 RSA keys
Verification successful
    ok 11 - signed content test streaming multipart S/MIME format, 2 DSA and 2 RSA keys
    ok 12 - enveloped content test streaming S/MIME format, 3 recipients
    ok 13 - enveloped content test streaming S/MIME format, 3 recipients, 3rd used
    ok 14 - enveloped content test streaming S/MIME format, 3 recipients, key only used
    ok 15 - enveloped content test streaming S/MIME format, AES-256 cipher, 3 recipients
ok 2 - CMS <= PKCS\#7 compatibility tests
#
    1..27
Verification successful
    ok 1 - signed content DER format, RSA key
Verification successful
    ok 2 - signed detached content DER format, RSA key
Verification successful
    ok 3 - signed content test streaming BER format, RSA
Verification successful
    ok 4 - signed content DER format, DSA key
Verification successful
    ok 5 - signed detached content DER format, DSA key
Verification successful
    ok 6 - signed detached content DER format, add RSA signer
Verification successful
    ok 7 - signed content test streaming BER format, DSA key
Verification successful
    ok 8 - signed content test streaming BER format, 2 DSA and 2 RSA keys
Verification successful
    ok 9 - signed content test streaming BER format, 2 DSA and 2 RSA keys, no attributes
Verification successful
    ok 10 - signed content test streaming S/MIME format, 2 DSA and 2 RSA keys
Verification successful
    ok 11 - signed content test streaming multipart S/MIME format, 2 DSA and 2 RSA keys
    ok 12 - enveloped content test streaming S/MIME format, 3 recipients
    ok 13 - enveloped content test streaming S/MIME format, 3 recipients, 3rd used
    ok 14 - enveloped content test streaming S/MIME format, 3 recipients, key only used
    ok 15 - enveloped content test streaming S/MIME format, AES-256 cipher, 3 recipients
Verification successful
    ok 16 - signed content test streaming BER format, 2 DSA and 2 RSA keys, keyid
Verification successful
    ok 17 - signed content test streaming PEM format, 2 DSA and 2 RSA keys
Verification successful
    ok 18 - signed content MIME format, RSA key, signed receipt request
Verification successful
    ok 19 - signed receipt MIME format, RSA key
    ok 20 - enveloped content test streaming S/MIME format, 3 recipients, keyid
    ok 21 - enveloped content test streaming PEM format, KEK
    ok 22 - enveloped content test streaming PEM format, KEK, key only
    ok 23 - data content test streaming PEM format
    ok 24 - encrypted content test streaming PEM format, 128 bit RC2 key
    ok 25 - encrypted content test streaming PEM format, 40 bit RC2 key
    ok 26 - encrypted content test streaming PEM format, triple DES key
    ok 27 - encrypted content test streaming PEM format, 128 bit AES key
ok 3 - CMS <=> CMS consistency tests
#
    1..11
Verification successful
    ok 1 - signed content test streaming PEM format, RSA keys, PSS signature
Verification successful
    ok 2 - signed content test streaming PEM format, RSA keys, PSS signature, no attributes
Verification successful
    ok 3 - signed content test streaming PEM format, RSA keys, PSS signature, SHA384 MGF1
    ok 4 - enveloped content test streaming S/MIME format, OAEP default parameters
    ok 5 - enveloped content test streaming S/MIME format, OAEP SHA256
    ok 6 - enveloped content test streaming S/MIME format, ECDH
    ok 7 - enveloped content test streaming S/MIME format, ECDH, key identifier
    ok 8 - enveloped content test streaming S/MIME format, ECDH, AES128, SHA256 KDF
    ok 9 - enveloped content test streaming S/MIME format, ECDH, K-283, cofactor DH
    ok 10 - enveloped content test streaming S/MIME format, X9.42 DH
Error creating CMS structure
135045376:error:2E068097:CMS routines:CMS_compress:unsupported compression algorithm:crypto/cms/cms_smime.c:879:
    not ok 11 - compressed content test streaming PEM format

    #   Failed test 'compressed content test streaming PEM format'
    #   at ../test/recipes/80-test_cms.t line 452.
    # Looks like you failed 1 test of 11.
not ok 4 - CMS <=> CMS consistency tests, modified key parameters
#

#   Failed test 'CMS <=> CMS consistency tests, modified key parameters
# '
#   at ../test/recipes/80-test_cms.t line 458.
# Looks like you failed 1 test of 4.
Dubious, test returned 1 (wstat 256, 0x100)
Failed 1/4 subtests

Test Summary Report
-------------------
../test/recipes/30-test_evp.t   (Wstat: 256 Tests: 1 Failed: 1)
  Failed test:  1
  Non-zero exit status: 1
../test/recipes/70-test_packet.t (Wstat: 256 Tests: 1 Failed: 1)
  Failed test:  1
  Non-zero exit status: 1
../test/recipes/80-test_cms.t   (Wstat: 256 Tests: 4 Failed: 1)
  Failed test:  4
  Non-zero exit status: 1
Files=3, Tests=6, 25 wallclock secs ( 0.17 usr  0.07 sys + 12.65 cusr 14.40 csys = 27.28 CPU)
Result: FAIL
Failed 3/3 test programs. 3/6 subtests failed.
*** Error code 1

Stop.                                    

> --
> Richard Levitte         [hidden email]
> OpenSSL Project         http://www.openssl.org/~levitte/
> --
> openssl-dev mailing list
> To unsubscribe: https://mta.openssl.org/mailman/listinfo/openssl-dev

--
Member - Liberal International This is doctor@@nl2k.ab.ca Ici doctor@@nl2k.ab.ca
God,Queen and country!Never Satan President Republic!Beware AntiChrist rising!
http://www.fullyfollow.me/rootnl2k  Look at Psalms 14 and 53 on Atheism
Manitoba and Saskatchewan! Save your provinces in April! Vote Liberal!!
--
openssl-dev mailing list
To unsubscribe: https://mta.openssl.org/mailman/listinfo/openssl-dev
Reply | Threaded
Open this post in threaded view
|

[openssl.org #4440] Re: Openssl-SNAP-20160315 issue Re: Openssl-SNAP-20160314 Re: Openssl SNAP 20160313 issue Re: OPenSSL SNAP 20160312 issue

Rich Salz via RT
On Wed, Mar 16, 2016 at 08:09:15PM +0100, Richard Levitte wrote:

> In message <[hidden email]> on Wed, 16 Mar 2016 12:26:29 -0600, The Doctor <[hidden email]> said:
>
> doctor> On Tue, Mar 15, 2016 at 10:13:50PM +0100, Richard Levitte wrote:
> doctor> > In message <[hidden email]> on Tue, 15 Mar 2016 14:50:22 -0600, The Doctor <[hidden email]> said:
> doctor> > doctor> perl -i -pe 's/^.*\|//; s/ \/(\\.|[^ ])*//;               # $_ = undef if (/: *$/ || /^(#.*| *)$/); # $_.="\n" unless !defined($_) or /\R$/g;' crypto/aes/aes_cfb.d.tmp    
> doctor> >
> doctor> > Actually, that perl line explained the issue just fine.  Thanks, I
> doctor> > know how to resolve this.
> doctor> >
> doctor> Just looked atthe Makefile.
> doctor>
> doctor> May I suggest instead of using perl, use -${PERL} instead.
>
> Good idea, I'll fix that.
>

And it works!

 

> doctor> When I did a symbolic like to perl, that worked
> doctor>
> doctor> Also  from my non-root account
> doctor>
> doctor> HARNESS_VERBOSE=yes make tests TESTS='test_evp test_packet test_cms'          
> doctor>
> doctor> yielded
> doctor>
> doctor> ../test/recipes/30-test_evp.t .....
> doctor> 1..1
> doctor> Test line 2548: unexpected error KEY_MISMATCH
> doctor> Expected: 77D6576238657B203B19CA42C18A0497F16B4844E3074AE8DFDFFA3FEDE21442FCD0069DED0948F8326A753A0FC81F17E8D3E0FB2E0D3628CF35E20C38D18906
> doctor> Got:      1E206D019AE5CD5575A1CD9BD56AF7AF094ACC8A903E163BF22A417CC7073B7B864FE17944690473DBED7E2FAA5A42069150BE9FF727AC1A251E04E52537B961
> doctor> Test line 2556: unexpected error KEY_MISMATCH
> doctor> Expected: FDBABE1C9D3472007856E7190D01E9FE7C6AD7CBC8237830E77376634B3731622EAF30D92E22A3886FF109279D9830DAC727AFB94A83EE6D8360CBDFA2CC0640
> doctor> Got:      4D0B8D57109EF588586B7812B70CD2FBD4DDE5F9AD1E45A17C565E24FE247DE986CA22CFDFF6C64346C62436F301EAE987A0E424B080EACB04E70830C3B9ACE0
> doctor> Test line 2564: unexpected error KEY_MISMATCH
> doctor> Expected: 7023BDCB3AFD7348461C06CD81FD38EBFDA8FBBA904F8E3EA9B543F6545DA1F2D5432955613F0FCF62D49705242A9AF9E61E85DC0D651E40DFCF017B45575887
> doctor> Got:      BF7268686B9059DAA738213780F8EEE8BC2FDD65D50DE1298B5ED2142040DB72E0CC5C6649C682EB8BC998A70D1CA8BCB73FF7367C1027403201F663239520D6
> doctor> 480 tests completed with 3 errors, 0 skipped
> doctor> not ok 1 - running evp_test evptests.txt
> doctor>
> doctor> #   Failed test 'running evp_test evptests.txt'
> doctor> #   at ../test/recipes/30-test_evp.t line 11.
> doctor> # Looks like you failed 1 test of 1.
> doctor> Dubious, test returned 1 (wstat 256, 0x100)
> doctor> Failed 1/1 subtests
> doctor> ../test/recipes/70-test_packet.t ..
> doctor> 1..1
> doctor> test_PACKET_buf_init() failed
> doctor> not ok 1 - running packettest
> doctor>
> doctor> #   Failed test 'running packettest'
> doctor> #   at ../test/testlib/OpenSSL/Test/Simple.pm line 70.
> doctor> # Looks like you failed 1 test of 1.
> doctor> Dubious, test returned 1 (wstat 256, 0x100)
> doctor> Failed 1/1 subtests
> doctor> ../test/recipes/80-test_cms.t .....
> doctor> 1..4
> doctor>     1..15
> doctor> Verification successful
> doctor>     ok 1 - signed content DER format, RSA key
> doctor> Verification successful
> doctor>     ok 2 - signed detached content DER format, RSA key
> doctor> Verification successful
> doctor>     ok 3 - signed content test streaming BER format, RSA
> doctor> Verification successful
> doctor>     ok 4 - signed content DER format, DSA key
> doctor> Verification successful
> doctor>     ok 5 - signed detached content DER format, DSA key
> doctor> Verification successful
> doctor>     ok 6 - signed detached content DER format, add RSA signer
> doctor> Verification successful
> doctor>     ok 7 - signed content test streaming BER format, DSA key
> doctor> Verification successful
> doctor>     ok 8 - signed content test streaming BER format, 2 DSA and 2 RSA keys
> doctor> Verification successful
> doctor>     ok 9 - signed content test streaming BER format, 2 DSA and 2 RSA keys, no attributes
> doctor> Verification successful
> doctor>     ok 10 - signed content test streaming S/MIME format, 2 DSA and 2 RSA keys
> doctor> Verification successful
> doctor>     ok 11 - signed content test streaming multipart S/MIME format, 2 DSA and 2 RSA keys
> doctor>     ok 12 - enveloped content test streaming S/MIME format, 3 recipients
> doctor>     ok 13 - enveloped content test streaming S/MIME format, 3 recipients, 3rd used
> doctor>     ok 14 - enveloped content test streaming S/MIME format, 3 recipients, key only used
> doctor>     ok 15 - enveloped content test streaming S/MIME format, AES-256 cipher, 3 recipients
> doctor> ok 1 - CMS => PKCS\#7 compatibility tests
> doctor> #
> doctor>     1..15
> doctor> Verification successful
> doctor>     ok 1 - signed content DER format, RSA key
> doctor> Verification successful
> doctor>     ok 2 - signed detached content DER format, RSA key
> doctor> Verification successful
> doctor>     ok 3 - signed content test streaming BER format, RSA
> doctor> Verification successful
> doctor>     ok 4 - signed content DER format, DSA key
> doctor> Verification successful
> doctor>     ok 5 - signed detached content DER format, DSA key
> doctor> Verification successful
> doctor>     ok 6 - signed detached content DER format, add RSA signer
> doctor> Verification successful
> doctor>     ok 7 - signed content test streaming BER format, DSA key
> doctor> Verification successful
> doctor>     ok 8 - signed content test streaming BER format, 2 DSA and 2 RSA keys
> doctor> Verification successful
> doctor>     ok 9 - signed content test streaming BER format, 2 DSA and 2 RSA keys, no attributes
> doctor> Verification successful
> doctor>     ok 10 - signed content test streaming S/MIME format, 2 DSA and 2 RSA keys
> doctor> Verification successful
> doctor>     ok 11 - signed content test streaming multipart S/MIME format, 2 DSA and 2 RSA keys
> doctor>     ok 12 - enveloped content test streaming S/MIME format, 3 recipients
> doctor>     ok 13 - enveloped content test streaming S/MIME format, 3 recipients, 3rd used
> doctor>     ok 14 - enveloped content test streaming S/MIME format, 3 recipients, key only used
> doctor>     ok 15 - enveloped content test streaming S/MIME format, AES-256 cipher, 3 recipients
> doctor> ok 2 - CMS <= PKCS\#7 compatibility tests
> doctor> #
> doctor>     1..27
> doctor> Verification successful
> doctor>     ok 1 - signed content DER format, RSA key
> doctor> Verification successful
> doctor>     ok 2 - signed detached content DER format, RSA key
> doctor> Verification successful
> doctor>     ok 3 - signed content test streaming BER format, RSA
> doctor> Verification successful
> doctor>     ok 4 - signed content DER format, DSA key
> doctor> Verification successful
> doctor>     ok 5 - signed detached content DER format, DSA key
> doctor> Verification successful
> doctor>     ok 6 - signed detached content DER format, add RSA signer
> doctor> Verification successful
> doctor>     ok 7 - signed content test streaming BER format, DSA key
> doctor> Verification successful
> doctor>     ok 8 - signed content test streaming BER format, 2 DSA and 2 RSA keys
> doctor> Verification successful
> doctor>     ok 9 - signed content test streaming BER format, 2 DSA and 2 RSA keys, no attributes
> doctor> Verification successful
> doctor>     ok 10 - signed content test streaming S/MIME format, 2 DSA and 2 RSA keys
> doctor> Verification successful
> doctor>     ok 11 - signed content test streaming multipart S/MIME format, 2 DSA and 2 RSA keys
> doctor>     ok 12 - enveloped content test streaming S/MIME format, 3 recipients
> doctor>     ok 13 - enveloped content test streaming S/MIME format, 3 recipients, 3rd used
> doctor>     ok 14 - enveloped content test streaming S/MIME format, 3 recipients, key only used
> doctor>     ok 15 - enveloped content test streaming S/MIME format, AES-256 cipher, 3 recipients
> doctor> Verification successful
> doctor>     ok 16 - signed content test streaming BER format, 2 DSA and 2 RSA keys, keyid
> doctor> Verification successful
> doctor>     ok 17 - signed content test streaming PEM format, 2 DSA and 2 RSA keys
> doctor> Verification successful
> doctor>     ok 18 - signed content MIME format, RSA key, signed receipt request
> doctor> Verification successful
> doctor>     ok 19 - signed receipt MIME format, RSA key
> doctor>     ok 20 - enveloped content test streaming S/MIME format, 3 recipients, keyid
> doctor>     ok 21 - enveloped content test streaming PEM format, KEK
> doctor>     ok 22 - enveloped content test streaming PEM format, KEK, key only
> doctor>     ok 23 - data content test streaming PEM format
> doctor>     ok 24 - encrypted content test streaming PEM format, 128 bit RC2 key
> doctor>     ok 25 - encrypted content test streaming PEM format, 40 bit RC2 key
> doctor>     ok 26 - encrypted content test streaming PEM format, triple DES key
> doctor>     ok 27 - encrypted content test streaming PEM format, 128 bit AES key
> doctor> ok 3 - CMS <=> CMS consistency tests
> doctor> #
> doctor>     1..11
> doctor> Verification successful
> doctor>     ok 1 - signed content test streaming PEM format, RSA keys, PSS signature
> doctor> Verification successful
> doctor>     ok 2 - signed content test streaming PEM format, RSA keys, PSS signature, no attributes
> doctor> Verification successful
> doctor>     ok 3 - signed content test streaming PEM format, RSA keys, PSS signature, SHA384 MGF1
> doctor>     ok 4 - enveloped content test streaming S/MIME format, OAEP default parameters
> doctor>     ok 5 - enveloped content test streaming S/MIME format, OAEP SHA256
> doctor>     ok 6 - enveloped content test streaming S/MIME format, ECDH
> doctor>     ok 7 - enveloped content test streaming S/MIME format, ECDH, key identifier
> doctor>     ok 8 - enveloped content test streaming S/MIME format, ECDH, AES128, SHA256 KDF
> doctor>     ok 9 - enveloped content test streaming S/MIME format, ECDH, K-283, cofactor DH
> doctor>     ok 10 - enveloped content test streaming S/MIME format, X9.42 DH
> doctor> Error creating CMS structure
> doctor> 135045376:error:2E068097:CMS routines:CMS_compress:unsupported compression algorithm:crypto/cms/cms_smime.c:879:
> doctor>     not ok 11 - compressed content test streaming PEM format
> doctor>
> doctor>     #   Failed test 'compressed content test streaming PEM format'
> doctor>     #   at ../test/recipes/80-test_cms.t line 452.
> doctor>     # Looks like you failed 1 test of 11.
> doctor> not ok 4 - CMS <=> CMS consistency tests, modified key parameters
> doctor> #
> doctor>
> doctor> #   Failed test 'CMS <=> CMS consistency tests, modified key parameters
> doctor> # '
> doctor> #   at ../test/recipes/80-test_cms.t line 458.
> doctor> # Looks like you failed 1 test of 4.
> doctor> Dubious, test returned 1 (wstat 256, 0x100)
> doctor> Failed 1/4 subtests
> doctor>
> doctor> Test Summary Report
> doctor> -------------------
> doctor> ../test/recipes/30-test_evp.t   (Wstat: 256 Tests: 1 Failed: 1)
> doctor>   Failed test:  1
> doctor>   Non-zero exit status: 1
> doctor> ../test/recipes/70-test_packet.t (Wstat: 256 Tests: 1 Failed: 1)
> doctor>   Failed test:  1
> doctor>   Non-zero exit status: 1
> doctor> ../test/recipes/80-test_cms.t   (Wstat: 256 Tests: 4 Failed: 1)
> doctor>   Failed test:  4
> doctor>   Non-zero exit status: 1
> doctor> Files=3, Tests=6, 24 wallclock secs ( 0.15 usr  0.08 sys + 12.15 cusr 15.10 csys = 27.48 CPU)
> doctor> Result: FAIL
> doctor> Failed 3/3 test programs. 3/6 subtests failed.
> doctor> *** Error code 1
> doctor>
> doctor> Stop.                                              
> doctor>
> doctor> The rest was fine.
>
> Would you mind submitting an email about these failures to
> [hidden email]?
>

I will CC openssl-SNAP-20160317 results

../test/recipes/30-test_evp.t .....
1..1
Test line 2548: unexpected error KEY_MISMATCH
Expected: 77D6576238657B203B19CA42C18A0497F16B4844E3074AE8DFDFFA3FEDE21442FCD0069DED0948F8326A753A0FC81F17E8D3E0FB2E0D3628CF35E20C38D18906
Got:      1E206D019AE5CD5575A1CD9BD56AF7AF094ACC8A903E163BF22A417CC7073B7B864FE17944690473DBED7E2FAA5A42069150BE9FF727AC1A251E04E52537B961
Test line 2556: unexpected error KEY_MISMATCH
Expected: FDBABE1C9D3472007856E7190D01E9FE7C6AD7CBC8237830E77376634B3731622EAF30D92E22A3886FF109279D9830DAC727AFB94A83EE6D8360CBDFA2CC0640
Got:      4D0B8D57109EF588586B7812B70CD2FBD4DDE5F9AD1E45A17C565E24FE247DE986CA22CFDFF6C64346C62436F301EAE987A0E424B080EACB04E70830C3B9ACE0
Test line 2564: unexpected error KEY_MISMATCH
Expected: 7023BDCB3AFD7348461C06CD81FD38EBFDA8FBBA904F8E3EA9B543F6545DA1F2D5432955613F0FCF62D49705242A9AF9E61E85DC0D651E40DFCF017B45575887
Got:      BF7268686B9059DAA738213780F8EEE8BC2FDD65D50DE1298B5ED2142040DB72E0CC5C6649C682EB8BC998A70D1CA8BCB73FF7367C1027403201F663239520D6
480 tests completed with 3 errors, 0 skipped
not ok 1 - running evp_test evptests.txt

#   Failed test 'running evp_test evptests.txt'
#   at ../test/recipes/30-test_evp.t line 11.
# Looks like you failed 1 test of 1.
Dubious, test returned 1 (wstat 256, 0x100)
Failed 1/1 subtests
../test/recipes/70-test_packet.t ..
1..1
test_PACKET_buf_init() failed
not ok 1 - running packettest

#   Failed test 'running packettest'
#   at ../test/testlib/OpenSSL/Test/Simple.pm line 70.
# Looks like you failed 1 test of 1.
Dubious, test returned 1 (wstat 256, 0x100)
Failed 1/1 subtests
../test/recipes/80-test_cms.t .....
1..4
    1..15
Verification successful
    ok 1 - signed content DER format, RSA key
Verification successful
    ok 2 - signed detached content DER format, RSA key
Verification successful
    ok 3 - signed content test streaming BER format, RSA
Verification successful
    ok 4 - signed content DER format, DSA key
Verification successful
    ok 5 - signed detached content DER format, DSA key
Verification successful
    ok 6 - signed detached content DER format, add RSA signer
Verification successful
    ok 7 - signed content test streaming BER format, DSA key
Verification successful
    ok 8 - signed content test streaming BER format, 2 DSA and 2 RSA keys
Verification successful
    ok 9 - signed content test streaming BER format, 2 DSA and 2 RSA keys, no attributes
Verification successful
    ok 10 - signed content test streaming S/MIME format, 2 DSA and 2 RSA keys
Verification successful
    ok 11 - signed content test streaming multipart S/MIME format, 2 DSA and 2 RSA keys
    ok 12 - enveloped content test streaming S/MIME format, 3 recipients
    ok 13 - enveloped content test streaming S/MIME format, 3 recipients, 3rd used
    ok 14 - enveloped content test streaming S/MIME format, 3 recipients, key only used
    ok 15 - enveloped content test streaming S/MIME format, AES-256 cipher, 3 recipients
ok 1 - CMS => PKCS\#7 compatibility tests
#
    1..15
Verification successful
    ok 1 - signed content DER format, RSA key
Verification successful
    ok 2 - signed detached content DER format, RSA key
Verification successful
    ok 3 - signed content test streaming BER format, RSA
Verification successful
    ok 4 - signed content DER format, DSA key
Verification successful
    ok 5 - signed detached content DER format, DSA key
Verification successful
    ok 6 - signed detached content DER format, add RSA signer
Verification successful
    ok 7 - signed content test streaming BER format, DSA key
Verification successful
    ok 8 - signed content test streaming BER format, 2 DSA and 2 RSA keys
Verification successful
    ok 9 - signed content test streaming BER format, 2 DSA and 2 RSA keys, no attributes
Verification successful
    ok 10 - signed content test streaming S/MIME format, 2 DSA and 2 RSA keys
Verification successful
    ok 11 - signed content test streaming multipart S/MIME format, 2 DSA and 2 RSA keys
    ok 12 - enveloped content test streaming S/MIME format, 3 recipients
    ok 13 - enveloped content test streaming S/MIME format, 3 recipients, 3rd used
    ok 14 - enveloped content test streaming S/MIME format, 3 recipients, key only used
    ok 15 - enveloped content test streaming S/MIME format, AES-256 cipher, 3 recipients
ok 2 - CMS <= PKCS\#7 compatibility tests
#
    1..27
Verification successful
    ok 1 - signed content DER format, RSA key
Verification successful
    ok 2 - signed detached content DER format, RSA key
Verification successful
    ok 3 - signed content test streaming BER format, RSA
Verification successful
    ok 4 - signed content DER format, DSA key
Verification successful
    ok 5 - signed detached content DER format, DSA key
Verification successful
    ok 6 - signed detached content DER format, add RSA signer
Verification successful
    ok 7 - signed content test streaming BER format, DSA key
Verification successful
    ok 8 - signed content test streaming BER format, 2 DSA and 2 RSA keys
Verification successful
    ok 9 - signed content test streaming BER format, 2 DSA and 2 RSA keys, no attributes
Verification successful
    ok 10 - signed content test streaming S/MIME format, 2 DSA and 2 RSA keys
Verification successful
    ok 11 - signed content test streaming multipart S/MIME format, 2 DSA and 2 RSA keys
    ok 12 - enveloped content test streaming S/MIME format, 3 recipients
    ok 13 - enveloped content test streaming S/MIME format, 3 recipients, 3rd used
    ok 14 - enveloped content test streaming S/MIME format, 3 recipients, key only used
    ok 15 - enveloped content test streaming S/MIME format, AES-256 cipher, 3 recipients
Verification successful
    ok 16 - signed content test streaming BER format, 2 DSA and 2 RSA keys, keyid
Verification successful
    ok 17 - signed content test streaming PEM format, 2 DSA and 2 RSA keys
Verification successful
    ok 18 - signed content MIME format, RSA key, signed receipt request
Verification successful
    ok 19 - signed receipt MIME format, RSA key
    ok 20 - enveloped content test streaming S/MIME format, 3 recipients, keyid
    ok 21 - enveloped content test streaming PEM format, KEK
    ok 22 - enveloped content test streaming PEM format, KEK, key only
    ok 23 - data content test streaming PEM format
    ok 24 - encrypted content test streaming PEM format, 128 bit RC2 key
    ok 25 - encrypted content test streaming PEM format, 40 bit RC2 key
    ok 26 - encrypted content test streaming PEM format, triple DES key
    ok 27 - encrypted content test streaming PEM format, 128 bit AES key
ok 3 - CMS <=> CMS consistency tests
#
    1..11
Verification successful
    ok 1 - signed content test streaming PEM format, RSA keys, PSS signature
Verification successful
    ok 2 - signed content test streaming PEM format, RSA keys, PSS signature, no attributes
Verification successful
    ok 3 - signed content test streaming PEM format, RSA keys, PSS signature, SHA384 MGF1
    ok 4 - enveloped content test streaming S/MIME format, OAEP default parameters
    ok 5 - enveloped content test streaming S/MIME format, OAEP SHA256
    ok 6 - enveloped content test streaming S/MIME format, ECDH
    ok 7 - enveloped content test streaming S/MIME format, ECDH, key identifier
    ok 8 - enveloped content test streaming S/MIME format, ECDH, AES128, SHA256 KDF
    ok 9 - enveloped content test streaming S/MIME format, ECDH, K-283, cofactor DH
    ok 10 - enveloped content test streaming S/MIME format, X9.42 DH
Error creating CMS structure
135045376:error:2E068097:CMS routines:CMS_compress:unsupported compression algorithm:crypto/cms/cms_smime.c:879:
    not ok 11 - compressed content test streaming PEM format

    #   Failed test 'compressed content test streaming PEM format'
    #   at ../test/recipes/80-test_cms.t line 452.
    # Looks like you failed 1 test of 11.
not ok 4 - CMS <=> CMS consistency tests, modified key parameters
#

#   Failed test 'CMS <=> CMS consistency tests, modified key parameters
# '
#   at ../test/recipes/80-test_cms.t line 458.
# Looks like you failed 1 test of 4.
Dubious, test returned 1 (wstat 256, 0x100)
Failed 1/4 subtests

Test Summary Report
-------------------
../test/recipes/30-test_evp.t   (Wstat: 256 Tests: 1 Failed: 1)
  Failed test:  1
  Non-zero exit status: 1
../test/recipes/70-test_packet.t (Wstat: 256 Tests: 1 Failed: 1)
  Failed test:  1
  Non-zero exit status: 1
../test/recipes/80-test_cms.t   (Wstat: 256 Tests: 4 Failed: 1)
  Failed test:  4
  Non-zero exit status: 1
Files=3, Tests=6, 25 wallclock secs ( 0.17 usr  0.07 sys + 12.65 cusr 14.40 csys = 27.28 CPU)
Result: FAIL
Failed 3/3 test programs. 3/6 subtests failed.
*** Error code 1

Stop.                                    

> --
> Richard Levitte         [hidden email]
> OpenSSL Project         http://www.openssl.org/~levitte/
> --
> openssl-dev mailing list
> To unsubscribe: https://mta.openssl.org/mailman/listinfo/openssl-dev

--
Member - Liberal International This is doctor@@nl2k.ab.ca Ici doctor@@nl2k.ab.ca
God,Queen and country!Never Satan President Republic!Beware AntiChrist rising!
http://www.fullyfollow.me/rootnl2k  Look at Psalms 14 and 53 on Atheism
Manitoba and Saskatchewan! Save your provinces in April! Vote Liberal!!


--
Ticket here: http://rt.openssl.org/Ticket/Display.html?id=4440
Please log in as guest with password guest if prompted

--
openssl-dev mailing list
To unsubscribe: https://mta.openssl.org/mailman/listinfo/openssl-dev
Reply | Threaded
Open this post in threaded view
|

[openssl.org #4440] Re: Openssl-SNAP-20160315 issue Re: Openssl-SNAP-20160314 Re: Openssl SNAP 20160313 issue Re: OPenSSL SNAP 20160312 issue

Rich Salz via RT
In reply to this post by The Doctor
Ticket appears to have been opened in error.

Closing.

Matt

--
Ticket here: http://rt.openssl.org/Ticket/Display.html?id=4440
Please log in as guest with password guest if prompted

--
openssl-dev mailing list
To unsubscribe: https://mta.openssl.org/mailman/listinfo/openssl-dev