Fwd: openssl 1-1-0-stable fails

Previous Topic Next Topic
 
classic Classic list List threaded Threaded
9 messages Options
Reply | Threaded
Open this post in threaded view
|

Fwd: openssl 1-1-0-stable fails

Blumenthal, Uri - 0553 - MITLL


Begin forwarded 

Subject: openssl 1-1-0-stable fails

OpenSSL_1_1_0-stable current Github

Test Summary Report
-------------------
../test/recipes/80-test_cms.t            (Wstat: 256 Tests: 4 Failed: 1)
  Failed test:  4
  Non-zero exit status: 1
Files=95, Tests=561, 165 wallclock secs ( 1.13 usr  0.30 sys + 84.96 cusr 42.27 csys = 128.66 CPU)
Result: FAIL

Config:

./config --prefix=$HOME/openssl-1.1 --openssldir=$HOME/openssl-1.1/etc enable-ec_nistp_64_gcc_128 enable-md2 enable-rc5 enable-weak-ssl-ciphers enable-zlib-dynamic enable-tls1_3 enable-tls13downgrade
--
Uri Blumenthal


--
openssl-dev mailing list
To unsubscribe: https://mta.openssl.org/mailman/listinfo/openssl-dev

smime.p7s (5K) Download Attachment
Reply | Threaded
Open this post in threaded view
|

Re: Fwd: openssl 1-1-0-stable fails

Matt Caswell-2


On 01/09/17 23:42, Blumenthal, Uri - 0553 - MITLL wrote:

>
>
> Begin forwarded
>
>> *Subject:* *openssl 1-1-0-stable fails*
>>
>> OpenSSL_1_1_0-stable current Github
>>
>> Test Summary Report
>> -------------------
>> ../test/recipes/80-test_cms.t            (Wstat: 256 Tests: 4 Failed: 1)
>>   Failed test:  4
>>   Non-zero exit status: 1
>> Files=95, Tests=561, 165 wallclock secs ( 1.13 usr  0.30 sys + 84.96
>> cusr 42.27 csys = 128.66 CPU)
>> Result: FAIL
>>
>> Config:
>>
>> ./config --prefix=$HOME/openssl-1.1 --openssldir=$HOME/openssl-1.1/etc
>> enable-ec_nistp_64_gcc_128 enable-md2 enable-rc5
>> enable-weak-ssl-ciphers enable-zlib-dynamic enable-tls1_3
>> enable-tls13downgrade

Errr....this config line is using options only available in master
(enablet-tls1_3 enable-tls13downgrade). Did you give the right line?

Matt

--
openssl-dev mailing list
To unsubscribe: https://mta.openssl.org/mailman/listinfo/openssl-dev
Reply | Threaded
Open this post in threaded view
|

Re: Fwd: openssl 1-1-0-stable fails

Blumenthal, Uri - 0553 - MITLL
On Sep 1, 2017, at 18:48, Matt Caswell <[hidden email]> wrote:
*Subject:* *openssl 1-1-0-stable fails*

OpenSSL_1_1_0-stable current Github

Test Summary Report
-------------------
../test/recipes/80-test_cms.t            (Wstat: 256 Tests: 4 Failed: 1)
 Failed test:  4
 Non-zero exit status: 1
Files=95, Tests=561, 165 wallclock secs ( 1.13 usr  0.30 sys + 84.96
cusr 42.27 csys = 128.66 CPU)
Result: FAIL

Config:

./config --prefix=$HOME/openssl-1.1 --openssldir=$HOME/openssl-1.1/etc
enable-ec_nistp_64_gcc_128 enable-md2 enable-rc5
enable-weak-ssl-ciphers enable-zlib-dynamic enable-tls1_3
enable-tls13downgrade

Errr....this config line is using options only available in master
(enablet-tls1_3 enable-tls13downgrade). Did you give the right line?

Yes, the branch is OpenSSL_1_1_0-stable. Apparently it does not complain seeing these un-realizable parameters. And error is “genuine”.

1.1 master also fails tests:

Test Summary Report
-------------------
../test/recipes/70-test_clienthello.t            (Wstat: 256 Tests: 1 Failed: 1)
  Failed test:  1
  Non-zero exit status: 1
Files=136, Tests=1266, 480 wallclock secs ( 2.72 usr  0.55 sys + 226.57 cusr 144.10 csys = 373.94 CPU)
Result: FAIL
make[1]: *** [_tests] Error 1
make: *** [tests] Error 2

Config:

./config --prefix=$HOME/openssl-1.1 --openssldir=$HOME/openssl-1.1/etc --with-rand-seed=rdcpu enable-aria enable-ec_nistp_64_gcc_128 enable-md2 enable-rc5 enable-weak-ssl-ciphers enable-zlib-dynamic enable-tls1_3 enable-tls13downgrade

As you see, for 1.1.1 master I’m enabling ARIA and setting default entropy source to RDRAND. ;-)


--
openssl-dev mailing list
To unsubscribe: https://mta.openssl.org/mailman/listinfo/openssl-dev
Reply | Threaded
Open this post in threaded view
|

Re: Fwd: openssl 1-1-0-stable fails

Blumenthal, Uri - 0553 - MITLL
All my builds include "make distclean" at the start of the process. However when I repeated that cleanup and re-run the build, 1_1_0-stable error disappeared. A fluke?!

Regards,
Uri

Sent from my iPhone

On Sep 1, 2017, at 21:10, Blumenthal, Uri - 0553 - MITLL <[hidden email]> wrote:

On Sep 1, 2017, at 18:48, Matt Caswell <[hidden email]> wrote:
*Subject:* *openssl 1-1-0-stable fails*

OpenSSL_1_1_0-stable current Github

Test Summary Report
-------------------
../test/recipes/80-test_cms.t            (Wstat: 256 Tests: 4 Failed: 1)
 Failed test:  4
 Non-zero exit status: 1
Files=95, Tests=561, 165 wallclock secs ( 1.13 usr  0.30 sys + 84.96
cusr 42.27 csys = 128.66 CPU)
Result: FAIL

Config:

./config --prefix=$HOME/openssl-1.1 --openssldir=$HOME/openssl-1.1/etc
enable-ec_nistp_64_gcc_128 enable-md2 enable-rc5
enable-weak-ssl-ciphers enable-zlib-dynamic enable-tls1_3
enable-tls13downgrade

Errr....this config line is using options only available in master
(enablet-tls1_3 enable-tls13downgrade). Did you give the right line?

Yes, the branch is OpenSSL_1_1_0-stable. Apparently it does not complain seeing these un-realizable parameters. And error is “genuine”.

1.1 master also fails tests:

Test Summary Report
-------------------
../test/recipes/70-test_clienthello.t            (Wstat: 256 Tests: 1 Failed: 1)
  Failed test:  1
  Non-zero exit status: 1
Files=136, Tests=1266, 480 wallclock secs ( 2.72 usr  0.55 sys + 226.57 cusr 144.10 csys = 373.94 CPU)
Result: FAIL
make[1]: *** [_tests] Error 1
make: *** [tests] Error 2

Config:

./config --prefix=$HOME/openssl-1.1 --openssldir=$HOME/openssl-1.1/etc --with-rand-seed=rdcpu enable-aria enable-ec_nistp_64_gcc_128 enable-md2 enable-rc5 enable-weak-ssl-ciphers enable-zlib-dynamic enable-tls1_3 enable-tls13downgrade

As you see, for 1.1.1 master I’m enabling ARIA and setting default entropy source to RDRAND. ;-)


--
openssl-dev mailing list
To unsubscribe: https://mta.openssl.org/mailman/listinfo/openssl-dev

smime.p7s (5K) Download Attachment
Reply | Threaded
Open this post in threaded view
|

1.1.1 master consistently fails (was Re: openssl 1-1-0-stable fails)

Blumenthal, Uri - 0553 - MITLL
MacOS 10.12.6, Xcode-8.3.3. Current Github master:

Test Summary Report
-------------------
../test/recipes/70-test_clienthello.t            (Wstat: 256 Tests: 1 Failed: 1)
  Failed test:  1
  Non-zero exit status: 1
Files=136, Tests=1266, 461 wallclock secs ( 2.58 usr  0.48 sys + 221.36 cusr 135.66 csys = 360.08 CPU)
Result: FAIL
make[1]: *** [_tests] Error 1
make: *** [tests] Error 2

Config & build script (feel free to suggest improvements, BTW):
#!/bin/bash -ex

make distclean || true
# For OpenSSL-1.1.1 master (development branch)
./config --prefix=$HOME/openssl-1.1 --openssldir=$HOME/openssl-1.1/etc --with-rand-seed=rdcpu enable-aria enable-ec_nistp_64_gcc_128 enable-md2 enable-rc5 enable-weak-ssl-ciphers enable-zlib-dynamic enable-tls1_3 enable-tls13downgrade
# For OpenSSL-1.1.0-stable
#./config --prefix=$HOME/openssl-1.1 --openssldir=$HOME/openssl-1.1/etc enable-ec_nistp_64_gcc_128 enable-md2 enable-rc5 enable-weak-ssl-ciphers enable-zlib-dynamic enable-tls1_3 enable-tls13downgrade
make depend && make clean && make -j 2 all && make test && make install


On Sep 2, 2017, at 21:15, Blumenthal, Uri - 0553 - MITLL <[hidden email]> wrote:

All my builds include "make distclean" at the start of the process. However when I repeated that cleanup and re-run the build, 1_1_0-stable error disappeared. A fluke?!

Regards,
Uri

Sent from my iPhone

Yes, the branch is OpenSSL_1_1_0-stable. Apparently it does not complain seeing these un-realizable parameters. And error is “genuine”.

1.1 master also fails tests:

Test Summary Report
-------------------
../test/recipes/70-test_clienthello.t            (Wstat: 256 Tests: 1 Failed: 1)
  Failed test:  1
  Non-zero exit status: 1
Files=136, Tests=1266, 480 wallclock secs ( 2.72 usr  0.55 sys + 226.57 cusr 144.10 csys = 373.94 CPU)
Result: FAIL
make[1]: *** [_tests] Error 1
make: *** [tests] Error 2

Config:

./config --prefix=$HOME/openssl-1.1 --openssldir=$HOME/openssl-1.1/etc --with-rand-seed=rdcpu enable-aria enable-ec_nistp_64_gcc_128 enable-md2 enable-rc5 enable-weak-ssl-ciphers enable-zlib-dynamic enable-tls1_3 enable-tls13downgrade

As you see, for 1.1.1 master I’m enabling ARIA and setting default entropy source to RDRAND. ;-)



--
openssl-dev mailing list
To unsubscribe: https://mta.openssl.org/mailman/listinfo/openssl-dev

smime.p7s (7K) Download Attachment
Reply | Threaded
Open this post in threaded view
|

Re: 1.1.1 master consistently fails (was Re: openssl 1-1-0-stable fails)

OpenSSL - Dev mailing list

Ø  Config & build script (feel free to suggest improvements, BTW):

 

Perhaps don’t cut/paste green-on-black color?  Plaintext is probably sufficient.

 


--
openssl-dev mailing list
To unsubscribe: https://mta.openssl.org/mailman/listinfo/openssl-dev
Reply | Threaded
Open this post in threaded view
|

Re: 1.1.1 master consistently fails (was Re: openssl 1-1-0-stable fails)

Matt Caswell-2
In reply to this post by Blumenthal, Uri - 0553 - MITLL


On 03/09/17 22:18, Blumenthal, Uri - 0553 - MITLL wrote:

> MacOS 10.12.6, Xcode-8.3.3. Current Github master:
>
> Test Summary Report
> -------------------
> ../test/recipes/70-test_clienthello.t            (Wstat: 256 Tests: 1
> Failed: 1)
>   Failed test:  1
>   Non-zero exit status: 1
> Files=136, Tests=1266, 461 wallclock secs ( 2.58 usr  0.48 sys + 221.36
> cusr 135.66 csys = 360.08 CPU)
> Result: FAIL
> make[1]: *** [_tests] Error 1
> make: *** [tests] Error 2

Fix here:

https://github.com/openssl/openssl/pull/4331


Matt

>
> Config & build script (feel free to suggest improvements, BTW):
> #!/bin/bash -ex
>
> make distclean || true
> # For OpenSSL-1.1.1 master (development branch)
> ./config --prefix=$HOME/openssl-1.1 --openssldir=$HOME/openssl-1.1/etc
> --with-rand-seed=rdcpu enable-aria enable-ec_nistp_64_gcc_128 enable-md2
> enable-rc5 enable-weak-ssl-ciphers enable-zlib-dynamic enable-tls1_3
> enable-tls13downgrade
> # For OpenSSL-1.1.0-stable
> #./config --prefix=$HOME/openssl-1.1 --openssldir=$HOME/openssl-1.1/etc
> enable-ec_nistp_64_gcc_128 enable-md2 enable-rc5 enable-weak-ssl-ciphers
> enable-zlib-dynamic enable-tls1_3 enable-tls13downgrade
> make depend && make clean && make -j 2 all && make test && make install
>
>
>> On Sep 2, 2017, at 21:15, Blumenthal, Uri - 0553 - MITLL
>> <[hidden email] <mailto:[hidden email]>> wrote:
>>
>> All my builds include "make distclean" at the start of the process.
>> However when I repeated that cleanup and re-run the build,
>> 1_1_0-stable error disappeared. A fluke?!
>>
>> Regards,
>> Uri
>>
>> Sent from my iPhone
>>>
>>> Yes, the branch is OpenSSL_1_1_0-stable. Apparently it does not
>>> complain seeing these un-realizable parameters. And error is “genuine”.
>>>
>>> 1.1 master also fails tests:
>>>
>>> Test Summary Report
>>> -------------------
>>> ../test/recipes/70-test_clienthello.t            (Wstat: 256 Tests: 1
>>> Failed: 1)
>>>   Failed test:  1
>>>   Non-zero exit status: 1
>>> Files=136, Tests=1266, 480 wallclock secs ( 2.72 usr  0.55 sys +
>>> 226.57 cusr 144.10 csys = 373.94 CPU)
>>> Result: FAIL
>>> make[1]: *** [_tests] Error 1
>>> make: *** [tests] Error 2
>>> $
>>>
>>> Config:
>>>
>>> ./config --prefix=$HOME/openssl-1.1
>>> --openssldir=$HOME/openssl-1.1/etc --with-rand-seed=rdcpu enable-aria
>>> enable-ec_nistp_64_gcc_128 enable-md2 enable-rc5
>>> enable-weak-ssl-ciphers enable-zlib-dynamic enable-tls1_3
>>> enable-tls13downgrade
>>>
>>> As you see, for 1.1.1 master I’m enabling ARIA and setting default
>>> entropy source to RDRAND. ;-)
>>>
>
>
>
--
openssl-dev mailing list
To unsubscribe: https://mta.openssl.org/mailman/listinfo/openssl-dev
Reply | Threaded
Open this post in threaded view
|

Re: 1.1.1 master consistently fails (was Re: openssl 1-1-0-stable fails)

Matt Caswell-2


On 04/09/17 08:59, Matt Caswell wrote:

>
>
> On 03/09/17 22:18, Blumenthal, Uri - 0553 - MITLL wrote:
>> MacOS 10.12.6, Xcode-8.3.3. Current Github master:
>>
>> Test Summary Report
>> -------------------
>> ../test/recipes/70-test_clienthello.t            (Wstat: 256 Tests: 1
>> Failed: 1)
>>   Failed test:  1
>>   Non-zero exit status: 1
>> Files=136, Tests=1266, 461 wallclock secs ( 2.58 usr  0.48 sys + 221.36
>> cusr 135.66 csys = 360.08 CPU)
>> Result: FAIL
>> make[1]: *** [_tests] Error 1
>> make: *** [tests] Error 2
>
> Fix here:
>
> https://github.com/openssl/openssl/pull/4331

This is now merged, so this issue should be fixed.


>
>
> Matt
>
>>
>> Config & build script (feel free to suggest improvements, BTW):
>> #!/bin/bash -ex
>>
>> make distclean || true
>> # For OpenSSL-1.1.1 master (development branch)
>> ./config --prefix=$HOME/openssl-1.1 --openssldir=$HOME/openssl-1.1/etc
>> --with-rand-seed=rdcpu enable-aria enable-ec_nistp_64_gcc_128 enable-md2
>> enable-rc5 enable-weak-ssl-ciphers enable-zlib-dynamic enable-tls1_3
>> enable-tls13downgrade
>> # For OpenSSL-1.1.0-stable
>> #./config --prefix=$HOME/openssl-1.1 --openssldir=$HOME/openssl-1.1/etc
>> enable-ec_nistp_64_gcc_128 enable-md2 enable-rc5 enable-weak-ssl-ciphers
>> enable-zlib-dynamic enable-tls1_3 enable-tls13downgrade
>> make depend && make clean && make -j 2 all && make test && make install
>>
>>
>>> On Sep 2, 2017, at 21:15, Blumenthal, Uri - 0553 - MITLL
>>> <[hidden email] <mailto:[hidden email]>> wrote:
>>>
>>> All my builds include "make distclean" at the start of the process.
>>> However when I repeated that cleanup and re-run the build,
>>> 1_1_0-stable error disappeared. A fluke?!
>>>
>>> Regards,
>>> Uri
>>>
>>> Sent from my iPhone
>>>>
>>>> Yes, the branch is OpenSSL_1_1_0-stable. Apparently it does not
>>>> complain seeing these un-realizable parameters. And error is “genuine”.
>>>>
>>>> 1.1 master also fails tests:
>>>>
>>>> Test Summary Report
>>>> -------------------
>>>> ../test/recipes/70-test_clienthello.t            (Wstat: 256 Tests: 1
>>>> Failed: 1)
>>>>   Failed test:  1
>>>>   Non-zero exit status: 1
>>>> Files=136, Tests=1266, 480 wallclock secs ( 2.72 usr  0.55 sys +
>>>> 226.57 cusr 144.10 csys = 373.94 CPU)
>>>> Result: FAIL
>>>> make[1]: *** [_tests] Error 1
>>>> make: *** [tests] Error 2
>>>> $
>>>>
>>>> Config:
>>>>
>>>> ./config --prefix=$HOME/openssl-1.1
>>>> --openssldir=$HOME/openssl-1.1/etc --with-rand-seed=rdcpu enable-aria
>>>> enable-ec_nistp_64_gcc_128 enable-md2 enable-rc5
>>>> enable-weak-ssl-ciphers enable-zlib-dynamic enable-tls1_3
>>>> enable-tls13downgrade
>>>>
>>>> As you see, for 1.1.1 master I’m enabling ARIA and setting default
>>>> entropy source to RDRAND. ;-)
>>>>
>>
>>
>>
--
openssl-dev mailing list
To unsubscribe: https://mta.openssl.org/mailman/listinfo/openssl-dev
Reply | Threaded
Open this post in threaded view
|

Re: 1.1.1 master consistently fails (was Re: openssl 1-1-0-stable fails)

Blumenthal, Uri - 0553 - MITLL
Fix confirmed, thank you!

Regards,
Uri

Sent from my iPhone

> On Sep 4, 2017, at 10:25, Matt Caswell <[hidden email]> wrote:
>
>
>
>> On 04/09/17 08:59, Matt Caswell wrote:
>>
>>
>>> On 03/09/17 22:18, Blumenthal, Uri - 0553 - MITLL wrote:
>>> MacOS 10.12.6, Xcode-8.3.3. Current Github master:
>>>
>>> Test Summary Report
>>> -------------------
>>> ../test/recipes/70-test_clienthello.t            (Wstat: 256 Tests: 1
>>> Failed: 1)
>>>  Failed test:  1
>>>  Non-zero exit status: 1
>>> Files=136, Tests=1266, 461 wallclock secs ( 2.58 usr  0.48 sys + 221.36
>>> cusr 135.66 csys = 360.08 CPU)
>>> Result: FAIL
>>> make[1]: *** [_tests] Error 1
>>> make: *** [tests] Error 2
>>
>> Fix here:
>>
>> https://github.com/openssl/openssl/pull/4331
>
> This is now merged, so this issue should be fixed.
>
>
>>
>>
>> Matt
>>
>>>
>>> Config & build script (feel free to suggest improvements, BTW):
>>> #!/bin/bash -ex
>>>
>>> make distclean || true
>>> # For OpenSSL-1.1.1 master (development branch)
>>> ./config --prefix=$HOME/openssl-1.1 --openssldir=$HOME/openssl-1.1/etc
>>> --with-rand-seed=rdcpu enable-aria enable-ec_nistp_64_gcc_128 enable-md2
>>> enable-rc5 enable-weak-ssl-ciphers enable-zlib-dynamic enable-tls1_3
>>> enable-tls13downgrade
>>> # For OpenSSL-1.1.0-stable
>>> #./config --prefix=$HOME/openssl-1.1 --openssldir=$HOME/openssl-1.1/etc
>>> enable-ec_nistp_64_gcc_128 enable-md2 enable-rc5 enable-weak-ssl-ciphers
>>> enable-zlib-dynamic enable-tls1_3 enable-tls13downgrade
>>> make depend && make clean && make -j 2 all && make test && make install
>>>
>>>
>>>> On Sep 2, 2017, at 21:15, Blumenthal, Uri - 0553 - MITLL
>>>> <[hidden email] <mailto:[hidden email]>> wrote:
>>>>
>>>> All my builds include "make distclean" at the start of the process.
>>>> However when I repeated that cleanup and re-run the build,
>>>> 1_1_0-stable error disappeared. A fluke?!
>>>>
>>>> Regards,
>>>> Uri
>>>>
>>>> Sent from my iPhone
>>>>>
>>>>> Yes, the branch is OpenSSL_1_1_0-stable. Apparently it does not
>>>>> complain seeing these un-realizable parameters. And error is “genuine”.
>>>>>
>>>>> 1.1 master also fails tests:
>>>>>
>>>>> Test Summary Report
>>>>> -------------------
>>>>> ../test/recipes/70-test_clienthello.t            (Wstat: 256 Tests: 1
>>>>> Failed: 1)
>>>>>  Failed test:  1
>>>>>  Non-zero exit status: 1
>>>>> Files=136, Tests=1266, 480 wallclock secs ( 2.72 usr  0.55 sys +
>>>>> 226.57 cusr 144.10 csys = 373.94 CPU)
>>>>> Result: FAIL
>>>>> make[1]: *** [_tests] Error 1
>>>>> make: *** [tests] Error 2
>>>>> $
>>>>>
>>>>> Config:
>>>>>
>>>>> ./config --prefix=$HOME/openssl-1.1
>>>>> --openssldir=$HOME/openssl-1.1/etc --with-rand-seed=rdcpu enable-aria
>>>>> enable-ec_nistp_64_gcc_128 enable-md2 enable-rc5
>>>>> enable-weak-ssl-ciphers enable-zlib-dynamic enable-tls1_3
>>>>> enable-tls13downgrade
>>>>>
>>>>> As you see, for 1.1.1 master I’m enabling ARIA and setting default
>>>>> entropy source to RDRAND. ;-)
>>>>>
>>>
>>>
>>>
> --
> openssl-dev mailing list
> To unsubscribe: https://mta.openssl.org/mailman/listinfo/openssl-dev

--
openssl-dev mailing list
To unsubscribe: https://mta.openssl.org/mailman/listinfo/openssl-dev

smime.p7s (5K) Download Attachment